program: Gaussian 09
title: 000291557
version: EM64L-G09RevD.01
frameworkgroup: C1[X(C8H10N2O3S)]
method: RPBEPBE
basis: SDD
operation: Freq
keyword: #p
keyword: freq=noraman
keyword: PBEPBE/SDD
title: #p freq=noraman PBEPBE/SDD
converged: YES YES NO NO
title: Mulliken charges:
elementType: S O O O N N C C C C C C C C H H H H H H H H H H
charge: 0.857827 -0.558010 -0.536387 -0.260363 -0.279205 -0.319221 -0.102421 -0.249623 -0.227740 -0.204826 -0.220238 -0.214738 0.309407 -0.751419 0.296961 0.309100 0.298096 0.242173 0.242299 0.237037 0.354382 0.224791 0.259586 0.292535
chargesum: 0.00000
title: Mulliken charges with hydrogens summed into heavy atoms:
elementType: S O O O N N C C C C C C C C
charge: 0.857827 -0.558010 -0.536387 -0.260363 0.018890 0.035161 -0.102421 0.047338 0.081360 0.037346 0.022060 0.022299 0.309407 0.025494
polarizability: 2.14384572e+02 -8.73703130e+00 1.47687955e+02 3.21320590e+00 -6.65434092e-01 8.51814001e+01
1716.lowfreq: -11.4702 -5.9516 0.0011 0.0014 0.0016 5.6963 36.3146 51.4262 60.0989
frequency: 36.2293 51.3835 60.0732 73.4490 98.5241 112.0272 129.6567 148.2494 174.5884 239.4641 249.6567 293.4606 310.5758 358.2920 382.8613 403.8019 414.3340 450.7699 495.4446 568.0212 601.2601 637.6093 649.7980 677.4176 687.7095 757.6177 767.7145 846.4170 852.8248 895.1155 935.6353 962.0358 972.6332 984.9729 986.7571 1004.2172 1006.1377 1030.8764 1041.3084 1077.5754 1147.6948 1171.9126 1182.0206 1207.0411 1306.3911 1337.9943 1381.7943 1382.7394 1435.0240 1446.2364 1452.0613 1461.2437 1488.5086 1572.8718 1599.4065 1633.1153 2996.1284 3086.9921 3128.4145 3131.5537 3138.8120 3150.5930 3161.3172 3172.5046 3193.7789 3534.9101
redmass: 4.0243 4.6292 6.2682 4.7380 1.0798 9.5192 6.0086 8.2487 5.9807 7.9244 7.3546 4.0513 7.3928 5.3572 6.1166 2.9212 4.9917 5.4366 4.5963 3.1872 6.4785 3.8696 6.9121 1.4233 2.5429 1.3712 14.4577 1.7896 1.7031 9.8048 1.3438 1.2836 4.8675 1.5543 1.7104 1.4173 3.8604 1.6266 2.0239 1.5618 3.8260 1.0681 1.1278 2.9408 1.2943 1.5433 7.8925 1.2288 2.2446 1.0876 1.9838 1.0702 1.2783 5.7136 6.8539 5.3579 1.0374 1.0975 1.0997 1.0887 1.0880 1.0914 1.0961 1.1014 1.0722 1.0792
irintensity: 1.4213 1.9043 3.0970 1.4338 0.4678 1.7357 8.3840 20.5825 0.7538 5.4985 17.8804 7.3735 4.5713 7.5203 12.0020 0.9908 36.1261 9.4167 58.1945 4.5000 0.1404 5.7022 2.1852 52.2425 25.4961 79.4201 63.2708 11.6679 15.8577 66.5777 5.6539 65.1044 5.1488 4.8369 21.6190 0.0359 2.0950 8.3983 18.1973 10.3639 155.9686 1.3810 9.7014 170.6079 11.2413 254.8747 3.5321 66.0962 20.1935 34.0064 19.5330 22.9608 40.6371 6.1747 0.9544 88.3570 2.9374 11.4999 6.3304 7.7363 4.1005 4.7251 4.4132 37.9427 30.1891 57.2400
temp: 298.150 k
press: 1.00000 atm
elementType: 16 8 8 8 7 7 6 6 6 6 6 6 6 6 1 1 1 1 1 1 1 1 1 1
symmnumber: 1
zpe: 456540.2 jmol-1
zpe.correction: 0.173887 hartree
zpe.thermalcorrener: 0.188727 hartree
zpe.thermalcorrenthalpy: 0.189671 hartree
zpe.thermalcorrgfe: 0.130714 hartree
zpe.sumelectzpe: -1042.862991 hartree
zpe.sumelectthermal: -1042.848152 hartree
zpe.sumelectthermalent: -1042.847207 hartree
zpe.sumelectthermalfe: -1042.906164 hartree
dipole: 0.6806 -3.3261 0.7031
dipole: 3.4671
quadrupole: -57.8375 -98.7723 -96.1353
quadrupole: 3.2294 -3.2406 2.5729
quadrupole: 26.4108 -14.5239 -11.8869 3.2294 -3.2406 2.5729
hfenergy: -1043.0368783 hartree
pointgroup: C01 [X(C8H10N2O3S1)]
dipole: 0.3118868 1.3278669 0.0124749 debye
dipolederiv: 1.0652369 -0.1399145 0.0502849 -0.0629154 1.0790384 0.0063868 -0.3026555 -0.1211132 0.892549 -0.4820761 0.0718892 -0.0448761 0.0866845 -0.4675685 -0.0195746 0.1254879 0.0633343 -0.6344244 -0.7195231 -0.0887595 -0.0386162 -0.1479717 -0.7364234 -0.0508148 0.0535668 0.0180808 -0.4254674 -0.3443608 0.335931 -0.1346479 -0.3068271 -0.906279 -0.0085082 -0.12608 0.1199099 -0.4710593 0.936947 0.3134052 -0.0660301 0.1940928 -0.0920361 -0.0076645 0.6294124 0.2045216 -0.4408403 -1.1276457 -0.2118959 0.1086334 -0.7988779 -0.6113672 -0.1888229 -1.0122346 -0.5828778 -0.1655215 0.0500541 -0.0491294 0.0237733 -0.2841329 -0.0715353 0.0092099 0.2124641 0.0315775 -0.1319845 -0.1844323 -0.0767001 -0.0234204 0.3598348 -0.0728817 0.051637 0.0857118 -0.0237599 -0.095346 -0.2973529 0.1465668 0.0259521 -0.0261149 -0.1039338 -0.0196124 -0.0258502 0.011213 -0.0771343 0.0680975 0.1226045 0.0851421 -0.0043188 -0.046619 0.0219205 0.0167102 0.0462146 -0.1160105 -0.0551425 -0.0407919 -0.0022547 0.0671512 0.1360012 0.0670662 0.0007036 0.0507407 -0.121494 0.0611274 -0.0871862 0.0357819 -0.0652274 0.030623 0.0220435 0.0349235 0.0178426 -0.1230755 0.4748346 -0.2957177 0.273996 0.8851475 1.4127824 0.2265271 0.7631277 0.335238 0.7706799 -0.0820392 -0.0311268 -0.1300996 -0.0235828 -0.0149115 0.028785 -0.3522751 -0.0288623 -0.3402495 0.1925511 0.0324642 0.0024277 -0.0500069 0.0452202 -0.0326311 0.0162328 -0.0091102 0.1597473 0.1099126 -0.0562439 -0.0207962 -0.0338153 0.1212572 -0.0061347 -0.0167749 -0.0028233 0.1331417 0.06411 -0.0164523 0.0122295 0.1677233 0.0468483 0.0235066 0.0160479 -0.0108632 0.2696296 -0.0920363 -0.0429906 -0.0651125 -0.0271988 0.0560302 -0.0341618 -0.0759961 -0.03304 0.1389028 0.0493633 0.0006496 -0.0199184 0.0374881 -0.0822943 -0.0509627 -0.0211529 -0.0491366 0.1432986 -0.0537225 0.1019058 -0.0262735 0.1057724 0.0330673 -0.0032245 -0.0159161 -0.0048402 0.1519309 0.295747 -0.001996 -0.0508541 -0.0813304 0.1598378 -0.0004374 -0.0829256 0.0108157 0.1904999 -0.0363057 0.0808219 -0.0198131 0.1201562 0.0289287 -0.038198 0.0535406 -0.0505811 0.0884885 0.0514791 -0.0330227 -0.0521092 -0.0741997 -0.0479514 -0.0486824 -0.0251149 -0.0187126 0.1222115 0.0551765 -0.0343109 0.0766011 -0.0375309 0.1041664 0.0523475 0.0490466 0.0262319 0.0815276 unknown
polarizability: 211.8643025|5.2008248|145.4250457|19.4951087|11.3970672|89.9645786 unknown
InChI: InChI=1S/C6H5O2S.C2H5N2O/c7-9(8)6-4-2-1-3-5-6;1-2(5)4-3/h1-5H;3-4H,1H3
charge 0 multiplicity 1
24 atoms
S  0.229504 -1.158342 -0.041475
O  0.960262 -0.836639 1.410611
O  -0.279589 -2.677465 -0.368313
O  2.103384 1.911044 0.120201
N  2.024046 -0.470682 -1.333724
N  2.908474 -0.213773 -0.328655
C  -1.295271 -0.03012 -0.178939
C  -2.4924 -0.627509 -0.606557
C  -1.162477 1.328795 0.150155
C  -3.636781 0.198929 -0.696999
C  -2.32063 2.13583 0.05113
C  -3.549275 1.572856 -0.370093
C  2.858859 0.966835 0.480716
C  3.738484 0.953097 1.704854
H  -2.520921 -1.696291 -0.843241
H  -0.201427 1.749078 0.469057
H  1.603943 0.464935 -1.580258
H  -4.590058 -0.23177 -1.020813
H  -2.257522 3.199919 0.301259
H  -4.439859 2.206366 -0.44447
H  3.441264 -1.02535 -0.003782
H  4.632433 0.318248 1.578209
H  4.048411 1.979155 1.954326
H  3.144045 0.549653 2.545699
