program: Gaussian 09
title: 000291524
version: EM64L-G09RevD.01
frameworkgroup: C1[X(C9H7BrN2O)]
method: RPBEPBE
basis: SDD
operation: Freq
keyword: #p
keyword: freq=noraman
keyword: PBEPBE/SDD
title: #p freq=noraman PBEPBE/SDD
converged: NO NO NO NO
title: Mulliken charges:
elementType: Br O N N C C C C C C C C C H H H H H H H
charge: 0.040990 -0.243705 -0.253527 -0.036063 0.134446 0.256689 0.394750 -0.530092 -0.116743 -0.300667 -0.230938 -0.162745 -0.755851 0.298578 0.273219 0.241865 0.250559 0.239145 0.250053 0.250039
chargesum: 0.00000
title: Mulliken charges with hydrogens summed into heavy atoms:
elementType: Br O N N C C C C C C C C C
charge: 0.040990 -0.243705 -0.253527 -0.036063 0.134446 0.256689 0.394750 -0.530092 0.181835 -0.027449 0.010927 0.087814 -0.016615
polarizability: 2.22016047e+02 2.80090030e+00 1.42410853e+02 1.83930538e-02 -9.89180216e-03 5.20265384e+01
1716.lowfreq: -83.3581 -0.0007 -0.0007 -0.0007 6.6063 10.3756 10.5026 62.1581 95.7363
frequency: -83.3539 62.1449 95.7324 158.6623 167.8752 238.2106 281.3365 289.7089 290.3419 352.7910 436.1762 438.1912 529.0969 542.6799 544.4029 607.3194 612.6202 651.1499 696.0570 762.3089 781.8425 787.5177 842.5579 877.2127 977.7480 978.8081 997.4335 1019.1459 1028.6473 1040.4008 1054.2496 1120.1046 1144.4581 1169.4703 1238.4758 1301.5431 1306.6493 1390.4351 1403.2832 1429.0093 1436.6940 1458.8195 1479.3184 1509.6765 1545.3349 1627.7464 1644.7419 2998.8183 3077.6328 3138.4051 3158.8651 3177.4381 3191.3671 3198.3743
redmass: 1.0252 7.7480 3.9587 4.9488 10.1990 8.3252 4.8917 4.1437 8.9037 5.5505 6.5233 3.6260 3.3297 7.3663 5.8504 7.8626 3.9896 5.9786 5.2504 6.0236 1.3487 7.7946 5.4333 1.4198 1.3272 4.7411 1.3136 2.2083 1.9889 1.5540 5.0191 1.8155 2.4841 1.7302 1.8371 2.3456 4.2347 1.4253 1.8449 2.5129 2.0998 1.0451 2.1748 4.2274 7.1698 6.7137 9.7171 1.0386 1.0968 1.0984 1.0889 1.0895 1.0961 1.1011
irintensity: 0.5748 1.5936 4.7783 0.0549 0.4440 1.7092 3.0101 2.6567 0.6054 4.2015 0.6142 3.9579 3.7696 0.1448 5.2524 9.1867 6.1998 4.6536 13.2833 11.6773 85.8320 43.7483 1.3672 1.0805 3.0135 36.5292 0.1818 3.5472 18.4756 7.0923 9.3792 30.5813 63.6207 11.4738 4.3255 3.5507 4.8781 23.2184 52.8220 82.4413 19.7862 15.4765 64.4067 175.0472 10.0453 144.3675 255.6542 6.2584 9.0171 9.9480 7.9527 4.7489 0.3005 11.3714
temp: 298.150 k
press: 1.00000 atm
elementType: 35 8 7 7 6 6 6 6 6 6 6 6 6 1 1 1 1 1 1 1
symmnumber: 1
zpe: 372571.1 jmol-1
zpe.correction: 0.141905 hartree
zpe.thermalcorrener: 0.152181 hartree
zpe.thermalcorrenthalpy: 0.153125 hartree
zpe.thermalcorrgfe: 0.104800 hartree
zpe.sumelectzpe: -544.437127 hartree
zpe.sumelectthermal: -544.426851 hartree
zpe.sumelectthermalent: -544.425907 hartree
zpe.sumelectthermalfe: -544.474231 hartree
dipole: -4.5276 1.9479 -0.0001
dipole: 4.9288
quadrupole: -64.6184 -87.4591 -86.4608
quadrupole: 7.6711 0.0013 0.0008
quadrupole: 14.8944 -7.9463 -6.9481 7.6711 0.0013 0.0008
hfenergy: -544.5790318 hartree
pointgroup: C01 [X(C9H7Br1N2O1)]
dipole: -1.6410833 -1.0330413 0.0000515 debye
dipolederiv: -0.6729538 -0.2421339 0.0001237 -0.3175091 -0.1176928 0.0000314 0.0001673 0.0000504 0.0035044 -0.3262312 0.077534 -0.0000158 -0.1266322 -1.2407775 0.0001129 0.0000486 0.0000441 -0.3506423 -0.2928475 -0.3896114 0.0000911 0.418675 -0.4957817 -0.0000234 -0.0001502 -0.0000524 0.0105081 -1.5188219 -0.0320036 0.0000922 0.1420195 -0.486251 0.000069 0.0000694 0.0000559 -0.2576198 1.0352905 -0.1308693 -0.0000529 -0.6992571 0.2083818 0.0000516 0.0002181 0.0001161 0.1348821 0.8010771 -0.2074969 -0.0000784 0.0216921 0.8174109 0.0000044 -0.000255 0.0000882 0.0927077 0.1837412 -0.0741483 -0.0000344 0.144958 1.5252961 -0.0001173 -0.0001288 -0.0001416 0.2308669 0.9165952 0.8427857 -0.0002143 0.4017827 -0.5547394 -0.0000619 -0.0001726 0.0000279 -0.1904342 -0.0614945 0.1614089 -0.000013 -0.1907564 -0.0071616 0.0000279 0.0001619 0.0000738 -0.0304576 -0.4938922 0.0848085 -0.0000096 0.0620988 0.0905221 -0.0000315 0.0000206 -0.0000089 -0.1574919 0.1112453 -0.2675375 0.0000125 0.2203418 -0.0621722 -0.0000549 -0.0001357 -0.0000674 -0.1782158 0.2034146 0.1025097 -0.0000002 -0.2804725 0.1683911 -0.0000031 0.0001142 0.0000573 -0.0952885 -0.1308727 0.0909639 0.0001007 0.3094351 -0.2251742 0.0000197 0.0003118 -0.0004519 0.0129714 0.1324493 -0.0490029 0.0000166 0.0367064 0.0873358 0.000004 0.0000134 0.0000316 0.1824847 0.0991591 0.0233016 0.0000148 -0.0266599 -0.0047607 0.0000235 -0.0000238 -0.0000035 0.1684508 -0.0045783 0.0729122 -0.0000002 0.0793584 0.0351381 0.0000222 -0.0000515 -0.0000342 0.1700169 -0.0542521 -0.0755654 -0.0000087 -0.0740708 0.0703747 -0.0000036 -0.0000325 -0.0000299 0.1599174 -0.061787 -0.0125194 -0.0002122 -0.1155889 0.0898773 -0.0001782 -0.0001718 0.0000652 0.1193832 0.0673834 0.0125193 -0.0387459 -0.003046 0.0509479 -0.090445 0.0007966 -0.1085335 -0.0129977 0.0673754 0.0121448 0.0389338 -0.0030749 0.0508352 0.0905521 -0.0007999 0.1087127 -0.0125458 unknown
polarizability: 220.963215|9.5156424|143.4636851|-0.0166388|-0.0126215|52.0265384 unknown
InChI: InChI=1S/C9H7BrN2O/c1-6-8(10)9(13)12-5-3-2-4-7(12)11-6/h2-5H,1H3
charge 0 multiplicity 1
20 atoms
Br 3.52165 1.155797 -0.000425
O  0.675019 2.489686 -0.000294
N  -0.657257 0.53359 -0.000073
N  0.353823 -1.671181 0.000132
C  -0.740406 -0.881807 0.000085
C  1.610135 -1.096181 0.000012
C  0.655854 1.228723 -0.000267
C  1.767639 0.302948 -0.000184
C  -1.796762 1.336308 -0.000089
C  -2.056676 -1.457701 0.000217
C  -3.059499 0.772086 0.000042
C  -3.193271 -0.657862 0.000196
C  2.749236 -2.085176 0.000064
H  -1.585816 2.40843 -0.000221
H  -2.1013 -2.549054 0.000335
H  -3.936744 1.4231 0.000024
H  -4.188092 -1.113616 0.000297
H  3.733746 -1.59774 0.001248
H  2.665506 -2.737635 -0.887675
H  2.664015 -2.739213 0.886478
