program: Gaussian 09
title: 000291534
version: EM64L-G09RevD.01
frameworkgroup: C1[X(C12H10ClNO3S)]
method: RPBEPBE
basis: SDD
operation: Freq
keyword: #p
keyword: freq=noraman
keyword: PBEPBE/SDD
title: #p freq=noraman PBEPBE/SDD
converged: YES YES NO NO
title: Mulliken charges:
elementType: Cl S O O O N C C C C C C C C C C C C H H H H H H H H H H
charge: -0.006944 0.946945 -0.527840 -0.513256 -0.397528 -0.518073 -0.074359 0.358552 -0.270394 -0.221311 -0.315766 -0.356873 -0.201964 -0.207256 -0.263204 -0.322073 0.381061 -0.217189 0.282544 0.288060 0.289434 0.315583 0.231483 0.227038 0.243735 0.245206 0.239727 0.364664
chargesum: 0.00000
title: Mulliken charges with hydrogens summed into heavy atoms:
elementType: Cl S O O O N C C C C C C C C C C C C
charge: -0.006944 0.946945 -0.527840 -0.513256 -0.032863 -0.235529 -0.074359 0.358552 0.017666 0.068123 -0.000183 -0.125390 0.041771 0.037950 -0.263204 -0.095035 0.381061 0.022537
polarizability: 2.54583993e+02 -1.78172121e+01 1.79997523e+02 2.08513409e+01 7.46143356e+00 1.51323509e+02
1716.lowfreq: -12.3066 -2.5872 0.0023 0.0025 0.0032 3.2632 10.9315 27.6295 42.1681
frequency: 10.1702 27.6186 41.9325 62.5050 78.6882 136.7899 142.6918 163.0269 177.3304 180.8567 223.1661 240.8378 245.1550 323.3835 344.0923 361.8027 371.9384 376.3844 404.9947 410.0489 435.4225 440.5353 484.1105 495.5342 503.6641 591.9019 601.5107 650.5642 671.4145 690.7823 714.8400 755.6203 760.0556 789.9656 798.6957 822.1519 853.3608 892.3239 894.4258 915.3093 934.8399 957.0295 976.6198 985.0934 1005.6915 1006.3004 1025.6093 1042.9574 1077.9959 1110.1742 1160.1590 1173.5628 1179.2177 1217.2677 1218.9975 1270.3779 1292.4860 1303.9077 1383.3989 1391.2001 1420.2949 1434.6909 1451.1292 1485.1438 1565.9534 1574.6338 1600.6452 1604.4787 3121.0235 3137.5399 3146.9636 3147.1906 3156.3151 3165.7161 3175.3165 3183.8966 3379.3989 3579.2763
redmass: 7.4959 6.2157 4.7193 8.9930 6.6440 6.1628 6.2991 7.6969 7.9229 11.6217 7.4609 9.2317 7.8223 6.9793 5.1720 1.1846 7.4058 8.7925 2.8528 4.2668 4.4707 4.8950 6.1996 3.8316 5.2125 3.6133 6.4749 7.0223 6.5501 2.5453 3.7589 2.3061 1.9873 1.5291 2.6241 3.1894 1.2386 2.3155 2.5460 1.3500 1.3372 9.4058 6.2068 1.3915 4.6585 1.3400 3.0624 2.0303 1.5657 1.5457 1.1723 1.0596 1.1206 1.6706 1.5227 2.8193 1.7136 1.3005 8.5504 4.4081 3.6848 2.2226 2.0047 2.8639 6.4799 5.7667 6.8262 6.8249 1.0877 1.0858 1.0961 1.0891 1.0928 1.0968 1.1014 1.0933 1.0757 1.0662
irintensity: 0.9442 0.7075 0.1253 1.4500 1.1584 0.4534 1.2621 15.5973 3.1998 1.6641 5.6151 6.1192 11.8901 0.6371 1.8552 113.5586 43.1696 4.2892 0.0384 7.8358 55.6479 24.9490 72.5451 59.0412 15.6908 9.4929 0.0137 2.7580 17.7476 28.5913 1.0553 64.0397 31.2409 56.2537 25.6640 163.3358 0.3030 30.9091 8.8092 0.6089 0.8739 62.4510 5.3588 0.3492 1.1223 0.6445 22.8848 19.5732 3.3998 208.7105 48.7163 0.3264 6.9485 30.8096 11.1422 115.6574 19.5479 3.4675 5.2171 16.6240 9.4750 16.0818 13.0684 108.5562 16.6258 6.3433 1.2031 50.2754 14.1161 1.3920 9.4780 5.0897 2.6390 5.2801 23.8907 3.6997 15.8608 81.3277
temp: 298.150 k
press: 1.00000 atm
elementType: 17 16 8 8 8 7 6 6 6 6 6 6 6 6 6 6 6 6 1 1 1 1 1 1 1 1 1 1
symmnumber: 1
zpe: 509179.1 jmol-1
zpe.correction: 0.193936 hartree
zpe.thermalcorrener: 0.211258 hartree
zpe.thermalcorrenthalpy: 0.212202 hartree
zpe.thermalcorrgfe: 0.146109 hartree
zpe.sumelectzpe: -1600.344091 hartree
zpe.sumelectthermal: -1600.326770 hartree
zpe.sumelectthermalent: -1600.325825 hartree
zpe.sumelectthermalfe: -1600.391918 hartree
dipole: 0.4267 8.3465 4.2061
dipole: 9.3561
quadrupole: -121.8220 -119.4339 -112.0078
quadrupole: 8.9809 -4.5126 1.9530
quadrupole: -4.0674 -1.6793 5.7468 8.9809 -4.5126 1.9530
hfenergy: -1600.5380275 hartree
pointgroup: C01 [X(C12H10Cl1N1O3S1)]
dipole: 0.0095384 3.196496 -1.8253745 debye
polarizability: 251.6618708|18.4364417|178.6500375|27.0665282|-7.8415978|155.593117 unknown
InChI: InChI=1S/C12H10ClNO3S/c13-11-8-9(6-7-12(11)15)14-18(16,17)10-4-2-1-3-5-10/h1-8,14-15H
charge 0 multiplicity 1
28 atoms
Cl 3.947125 -0.608532 1.94742
S  -1.597828 -1.755354 0.161159
O  -2.788363 -2.588856 -0.567622
O  -0.984202 -2.149511 1.610899
O  4.369304 1.452604 -0.157647
N  -0.079165 -1.909767 -1.101534
C  -2.125375 0.066489 0.25493
C  0.994006 -1.009094 -0.887482
C  -3.127643 0.50362 -0.627764
C  -1.499618 0.889118 1.206624
C  1.816839 -1.204866 0.261518
C  1.304487 0.044243 -1.793357
C  -3.519745 1.860114 -0.549965
C  -1.903409 2.243728 1.263273
C  2.913083 -0.362473 0.48231
C  2.436496 0.852382 -1.582072
C  3.249052 0.669058 -0.435078
C  -2.904759 2.725193 0.386959
H  -0.542297 -1.812612 -2.02463
H  -3.604376 -0.198284 -1.320188
H  -0.749899 0.479176 1.890732
H  1.586357 -2.01965 0.953045
H  0.670151 0.216325 -2.670803
H  2.684388 1.644601 -2.299698
H  -4.307055 2.235214 -1.212041
H  -1.441026 2.914556 1.994576
H  -3.215536 3.774094 0.441884
H  4.518908 2.123987 -0.869348
