program: Gaussian 09
title: 000027977
version: EM64L-G09RevD.01
frameworkgroup: C1[X(C11H9BrO)]
method: RPBEPBE
basis: SDD
operation: Freq
keyword: #p
keyword: freq=noraman
keyword: PBEPBE/SDD
title: #p freq=noraman PBEPBE/SDD
converged: NO YES NO YES
title: Mulliken charges:
elementType: Br O C C C C C C C C C C C H H H H H H H H H
charge: -0.002848 -0.441753 0.262911 0.420493 0.176587 0.142165 -0.443552 -0.378953 -0.372909 -0.415217 -0.829395 -0.210283 -0.227834 0.242233 0.252414 0.258673 0.218951 0.229673 0.280702 0.229644 0.248937 0.359360
chargesum: 0.00000
title: Mulliken charges with hydrogens summed into heavy atoms:
elementType: Br O C C C C C C C C C C C
charge: -0.002848 -0.082393 0.262911 0.420493 0.176587 0.142165 -0.201319 -0.126539 -0.114235 -0.196265 -0.089376 0.038654 -0.227834
polarizability: 2.39039044e+02 -1.05517060e+01 1.40900845e+02 1.15253937e-02 3.54253160e-03 5.55380430e+01
1716.lowfreq: -6.7989 0.0000 0.0003 0.0006 6.4121 8.0552 62.7070 117.8374 147.0768
frequency: 62.6991 117.8269 147.0767 162.3180 182.7996 223.8879 236.3246 321.3892 328.2801 330.9342 351.2176 416.3107 462.8975 483.8280 520.3159 522.1959 560.0943 589.3371 657.2923 685.2997 746.8758 770.8674 796.4604 824.6478 861.0128 879.0048 889.9431 944.4135 967.6136 1040.1763 1049.3029 1054.3538 1074.9166 1156.1243 1166.2937 1218.6794 1227.7735 1248.9647 1272.1928 1342.4130 1383.6464 1396.7599 1423.8640 1424.0335 1464.8099 1477.0503 1484.7262 1501.2307 1587.1871 1597.9615 1633.9172 2978.1803 3048.7913 3110.4197 3119.0258 3146.6482 3150.3660 3151.9521 3174.2133 3587.4577
redmass: 7.8791 3.2119 7.3150 1.0836 4.6145 10.5755 3.6610 3.4093 1.1154 4.9539 5.6923 3.0967 5.3760 5.7588 5.5081 3.0372 3.5427 5.2206 3.5686 6.1922 6.9296 2.4994 1.4660 1.7112 3.7865 3.5423 1.4761 1.4081 1.3307 1.5050 1.8465 3.3767 2.1598 1.3838 1.1886 1.5573 1.8218 2.8168 1.7259 2.4666 3.6215 1.2565 8.1876 2.9639 2.3964 1.1944 1.0465 4.4240 7.6004 6.0655 6.5937 1.0396 1.0973 1.0880 1.0959 1.0963 1.0883 1.0915 1.0969 1.0661
irintensity: 0.0563 0.0663 0.2642 0.0092 1.3827 1.0606 14.4603 0.5620 132.2546 13.0718 2.9210 6.1264 9.1004 13.0901 0.5794 5.1616 0.2954 0.2875 12.8609 2.8984 0.6947 0.0132 33.1147 48.2832 26.6438 95.2045 22.8424 5.6388 0.7320 1.7771 111.7638 12.5411 50.4957 31.1100 36.4724 10.0195 7.3969 193.7454 6.4152 3.5911 17.5079 21.3656 0.4669 7.3627 2.9722 11.9780 16.3539 81.0293 16.8885 50.9010 28.6094 26.0389 20.7224 13.2167 5.6572 13.3292 5.7826 2.3057 8.6766 56.4302
temp: 298.150 k
press: 1.00000 atm
elementType: 35 8 6 6 6 6 6 6 6 6 6 6 6 1 1 1 1 1 1 1 1 1
symmnumber: 1
zpe: 435061.5 jmol-1
zpe.correction: 0.165706 hartree
zpe.thermalcorrener: 0.177142 hartree
zpe.thermalcorrenthalpy: 0.178086 hartree
zpe.thermalcorrgfe: 0.127708 hartree
zpe.sumelectzpe: -512.353608 hartree
zpe.sumelectthermal: -512.342172 hartree
zpe.sumelectthermalent: -512.341228 hartree
zpe.sumelectthermalfe: -512.391606 hartree
dipole: 2.8891 -1.1998 0.0001
dipole: 3.1283
quadrupole: -80.9667 -71.8643 -90.3075
quadrupole: -8.7193 -0.0009 0.0009
quadrupole: 0.0795 9.1819 -9.2614 -8.7193 -0.0009 0.0009
hfenergy: -512.5193144 hartree
pointgroup: C01 [X(C11H9Br1O1)]
dipole: 1.1616632 -0.4066654 0.0000237 debye
dipolederiv: -0.8329898 -0.0608947 -0.000029 -0.1492871 -0.0845861 -0.0000929 0.0003562 0.0001049 -0.0472929 -1.7151787 0.0529207 -0.0001229 -0.1880002 -0.0515939 0.0000594 -0.0001237 0.0000901 -0.414518 0.3428482 -0.0578308 0.0000029 -0.0068936 -0.1625464 -0.0000141 -0.0001527 0.0000002 0.00827 -0.0244016 0.0288047 -0.000008 -0.0565671 -0.1416298 -0.0000257 0.0002008 0.0000225 0.0399183 -0.3713207 0.0188914 -0.0000458 0.4229675 0.2638828 0.0000895 0.0001532 0.0001004 -0.0728148 1.5597858 -0.0108147 0.000175 0.0369765 -0.1037036 -0.0000263 0.0001126 -0.0000094 0.0505515 0.0485736 -0.1338632 -0.0000113 -0.0538502 0.1070499 -0.0000078 0.0000518 -0.0000334 -0.163989 -0.0516689 -0.0221005 -0.000008 -0.0606381 0.0722201 0.0000095 0.0001141 0.0000175 -0.1580933 -0.3080993 -0.051284 -0.0000313 -0.0246045 0.0501226 -0.0000247 0.0000983 -0.0000337 -0.1115142 -0.2755312 0.0564312 -0.0000258 -0.2290924 0.1085416 -0.0000067 -0.0000803 0.0000347 -0.1755966 -0.0191514 -0.0050801 0.0000688 -0.0902291 -0.1167299 -0.0000356 -0.0001934 -0.0001788 0.0841451 -0.393938 -0.0989342 -0.0000307 -0.0207914 0.1058863 0.0000931 -0.0002585 -0.0000228 -0.1039538 1.3595873 0.2209928 0.0000963 0.2913788 -0.0227121 0.0000491 -0.0005533 -0.0000582 -0.1370334 0.0573719 -0.0883221 -0.0000156 -0.0256547 -0.0701563 0.0000218 0.0000416 -0.0000054 0.1580469 0.0498002 -0.0746038 -0.0000081 -0.0320799 -0.0634989 -0.0000177 -0.0000194 -0.0000208 0.1459353 0.0772539 -0.0172892 0.0000118 -0.0679317 -0.0409972 0.0000366 0.000053 -0.0000069 0.1581502 -0.0768864 0.1208289 -0.0000051 0.0922807 -0.0134036 0. 0.0000005 -0.0000082 0.1660901 0.0864708 0.0486272 0.0860438 -0.0123427 -0.0198278 -0.0736171 0.0418166 -0.1061896 -0.0432808 -0.0744593 -0.0646089 0.000051 0.0333057 0.1237278 -0.0000168 0.0000379 0.0000323 0.1171017 0.0863967 0.0488101 -0.0861614 -0.0122101 -0.0198642 0.0736215 -0.0417068 0.1062359 -0.0430889 0.0228034 0.0873253 0.0000396 0.0784996 0.0106319 -0.0000404 0.0000626 -0.0000057 0.1611517 0.4527335 0.0019938 0.0000137 0.074764 0.0691869 -0.0000549 -0.0000111 -0.0000656 0.381815 unknown
polarizability: 239.9196399|-4.9135489|140.0202493|0.0113054|0.004192|55.538043 unknown
InChI: InChI=1S/C11H9BrO/c1-7-10-4-3-9(12)6-8(10)2-5-11(7)13/h2-6,13H,1H3
charge 0 multiplicity 1
22 atoms
Br -4.615689 -0.380678 -0.000205
O  3.792833 -0.063712 0.000482
C  0.117361 0.507135 0.000165
C  -0.377385 -0.857798 0.000022
C  1.534976 0.77058 0.00027
C  2.40844 -0.329539 0.000278
C  0.562303 -1.938601 0.000006
C  -0.849997 1.569203 0.000219
C  -1.789009 -1.108623 -0.000091
C  1.930026 -1.679784 0.000166
C  2.079031 2.185372 0.000403
C  -2.223089 1.312153 0.000102
C  -2.67854 -0.039079 -0.000057
H  0.194864 -2.970711 -0.000075
H  -0.508694 2.608835 0.000356
H  -2.150651 -2.141816 -0.000195
H  2.649394 -2.509731 0.000211
H  1.740219 2.747091 0.891659
H  3.178749 2.174555 -0.000054
H  1.739435 2.747574 -0.890234
H  -2.945342 2.133412 0.000137
H  4.312465 -0.905038 0.000335
