program: Gaussian 09
title: 000291486
version: EM64L-G09RevD.01
frameworkgroup: C1[X(C21H15N3O2S)]
method: RPBEPBE
basis: SDD
operation: Freq
keyword: #p
keyword: freq=noraman
keyword: PBEPBE/SDD
title: #p freq=noraman PBEPBE/SDD
converged: YES YES NO NO
title: Mulliken charges:
elementType: S O O N N N C C C C C C C C C C C C C C C C C C C C C H H H H H H H H H H H H H H H
charge: 0.768970 -0.590791 -0.402818 -0.259020 -0.049002 -0.255800 0.390641 -0.233912 0.345639 0.319453 -0.139611 -0.353311 0.168954 -0.412919 -0.381137 -0.214042 -0.337448 -0.233964 -0.260949 -0.129913 -0.250014 -0.182554 -0.235654 -0.216660 -0.204946 -0.203654 -0.218277 0.265688 0.224814 0.280553 0.224346 0.321326 0.259386 0.234344 0.231928 0.233444 0.238499 0.290392 0.255569 0.238646 0.237829 0.235977
chargesum: 0.00000
title: Mulliken charges with hydrogens summed into heavy atoms:
elementType: S O O N N N C C C C C C C C C C C C C C C C C C C C C
charge: 0.768970 -0.590791 -0.402818 -0.259020 -0.049002 -0.030986 0.390641 -0.233912 0.345639 0.319453 -0.139611 -0.087623 0.168954 -0.132366 -0.156791 0.107284 -0.078062 0.000380 -0.029021 -0.129913 -0.016570 0.055945 0.054738 0.038909 0.033700 0.034176 0.017700
polarizability: 3.50659931e+02 -4.29462706e+01 3.62100964e+02 -2.58309209e+01 -5.35919918e+00 2.06480024e+02
1716.lowfreq: -3.0996 -0.0007 0.0011 0.0014 2.7540 7.7591 15.1613 23.1058 27.2104
frequency: 14.7255 23.0338 27.0996 46.4827 58.7129 66.6904 90.9118 119.3286 129.4071 141.6986 170.8117 183.4357 194.2615 225.1366 240.6127 275.7681 292.1948 320.9045 332.5893 351.0695 374.7540 390.1369 400.9016 421.2874 427.2573 446.7921 475.0050 485.8329 500.9013 523.1504 548.7433 579.7834 581.3628 605.9720 625.3460 630.5319 659.9992 663.5334 680.5469 691.2220 708.9139 736.1800 748.8185 756.3640 764.8497 772.4807 781.6647 815.3852 832.7172 842.6464 852.8911 854.7347 862.0082 899.2959 907.5733 911.4583 934.8592 951.2856 963.3820 978.0442 981.2855 986.7669 993.8300 1000.9530 1005.8090 1010.9880 1012.2977 1038.5942 1045.6187 1048.6874 1077.2162 1095.8992 1123.2025 1150.0081 1167.5968 1172.1788 1176.0836 1178.5381 1192.3195 1231.4429 1239.1808 1272.7728 1293.0656 1302.2778 1313.0496 1321.3678 1326.9181 1376.2297 1386.4010 1387.1075 1414.4488 1432.8268 1440.8232 1455.3704 1459.0018 1485.1124 1505.5456 1523.2952 1559.6915 1564.3816 1583.2806 1588.2409 1598.5257 1621.7750 1634.7652 2996.7925 3115.5477 3128.0468 3132.0589 3137.3892 3138.7184 3146.7683 3153.9513 3155.7836 3158.6167 3169.5417 3171.4169 3180.0309 3189.4495 3303.5728
redmass: 6.0245 4.8759 4.6704 6.9188 7.7906 5.5176 5.7569 4.6330 7.5687 6.0902 5.8992 5.5264 5.8609 6.7079 6.4467 7.0494 7.2408 5.4986 9.8033 6.2576 6.5162 6.6643 2.8638 4.4605 5.5700 3.5580 4.6157 6.9722 6.5606 5.0149 4.6251 4.0542 6.7602 6.4807 6.8118 4.8816 5.8019 6.7557 5.0212 2.3297 4.0618 4.3857 3.5248 1.4964 1.5122 2.8817 1.7897 6.4491 7.8626 6.0978 1.3660 3.1121 1.4281 1.7202 2.7278 2.1538 1.3578 1.3454 1.4051 1.2877 6.0320 1.3878 3.3250 1.3536 1.3348 3.8084 2.5268 2.1114 3.5087 2.1413 1.5672 2.4973 1.5593 1.4316 1.8392 1.0690 1.0887 1.1144 2.1957 1.8005 2.6206 1.5646 1.6018 1.3163 1.7766 1.7183 1.9821 8.1764 3.0477 9.4468 2.7799 2.1835 2.6217 2.0424 3.5191 3.4269 4.5600 6.0468 7.3425 7.0782 5.8807 7.9904 6.6694 6.9235 6.4651 1.0846 1.0877 1.0966 1.0858 1.0883 1.0881 1.0920 1.0888 1.0940 1.0968 1.0996 1.1016 1.0943 1.0989 1.0750
irintensity: 0.7598 0.1820 0.1832 0.8892 2.0516 5.1115 0.4563 0.6748 3.7286 2.0589 4.4739 6.1666 2.2675 0.8221 1.0976 1.7805 1.2992 2.4918 10.5979 6.1149 7.8962 8.8535 0.4438 6.4033 20.5962 6.2554 4.7404 8.6736 26.7297 11.1427 13.1000 2.1241 1.5693 0.0298 0.2128 3.4145 14.0177 2.7419 22.7426 35.8095 2.3940 13.4430 10.0320 57.6124 104.8753 39.2770 52.5520 14.3473 62.9688 27.4437 3.8421 25.7337 3.2820 4.1517 75.4269 68.5056 7.1515 9.6721 3.8989 0.6018 3.0129 1.1867 26.6519 0.5323 1.0298 2.4283 2.0415 14.7232 3.4583 22.4499 7.0950 17.1804 5.1951 20.6637 23.7616 2.0178 1.9443 6.6713 4.4089 21.8596 47.3490 14.8779 28.8440 3.4311 28.8117 89.9688 9.1231 2.6326 48.4867 4.0309 29.4535 12.5564 5.2546 10.8244 23.4768 17.4057 24.1483 3.8748 23.8793 45.7249 0.4414 14.2841 1.2365 20.0258 10.3726 7.5659 6.2911 21.5230 1.4046 7.9318 2.7515 1.5426 5.4659 19.3444 16.7909 24.9357 32.4406 4.1880 12.4002 16.2390
temp: 298.150 k
press: 1.00000 atm
elementType: 16 8 8 7 7 7 6 6 6 6 6 6 6 6 6 6 6 6 6 6 6 6 6 6 6 6 6 1 1 1 1 1 1 1 1 1 1 1 1 1 1 1
symmnumber: 1
zpe: 813137.3 jmol-1
zpe.correction: 0.309708 hartree
zpe.thermalcorrener: 0.331581 hartree
zpe.thermalcorrenthalpy: 0.332526 hartree
zpe.thermalcorrgfe: 0.256244 hartree
zpe.sumelectzpe: -1520.059049 hartree
zpe.sumelectthermal: -1520.037175 hartree
zpe.sumelectthermalent: -1520.036231 hartree
zpe.sumelectthermalfe: -1520.112512 hartree
dipole: -1.8772 -1.5845 -2.4254
dipole: 3.4521
quadrupole: -145.4111 -134.9551 -167.9652
quadrupole: -8.5172 9.2981 2.2861
quadrupole: 4.0327 14.4887 -18.5214 -8.5172 9.2981 2.2861
hfenergy: -1520.3687567 hartree
pointgroup: C01 [X(C21H15N3O2S1)]
dipole: -0.8647443 0.207122 1.0265875 debye
polarizability: 320.6153669|-12.9995596|373.587397|18.8599159|-62.2128481|225.0381548 unknown
InChI: InChI=1S/C21H15N3O2S/c22-18-15-10-4-5-11-16(15)19-20(24-13-7-6-12-17(24)23-19)21(18)26-27(25)14-8-2-1-3-9-14/h1-13,21-22H
charge 0 multiplicity 1
42 atoms
S  -2.163938 -1.829575 -0.673304
O  -1.127314 -3.108362 -0.783813
O  -1.051472 -0.329356 -0.216386
N  2.074783 -0.726737 -0.162223
N  3.062022 1.347278 0.12745
N  -1.484086 1.030053 -3.011645
C  1.219658 0.221111 -0.724274
C  1.838411 1.467833 -0.523513
C  1.188294 2.7047 -0.949141
C  -0.043491 2.607539 -1.677725
C  -0.595539 1.266968 -2.07302
C  -0.10191 0.004567 -1.344319
C  3.207399 0.006783 0.350412
C  1.736879 3.974488 -0.647203
C  -0.71056 3.803213 -2.046912
C  1.953909 -2.104289 -0.036529
C  4.250283 -0.727248 0.973955
C  1.067158 5.150162 -1.040768
C  -0.16533 5.065712 -1.735018
C  -2.820121 -1.917403 1.086812
C  2.984097 -2.802606 0.581826
C  4.140855 -2.117403 1.083802
C  -2.413361 -3.005063 1.878169
C  -3.708591 -0.924996 1.544715
C  -2.919614 -3.10077 3.193874
C  -4.205963 -1.033562 2.863755
C  -3.812978 -2.118442 3.683896
H  -0.115871 -0.836694 -2.06489
H  -1.817997 1.895224 -3.488538
H  2.683706 4.013097 -0.099667
H  -1.672388 3.753646 -2.572394
H  1.034396 -2.567205 -0.411556
H  5.112672 -0.175347 1.355139
H  1.494892 6.129929 -0.802312
H  -0.697441 5.978024 -2.024661
H  2.892578 -3.886968 0.683417
H  4.940725 -2.69124 1.56194
H  -1.717677 -3.742633 1.460725
H  -3.99509 -0.08274 0.906215
H  -2.618261 -3.93743 3.832999
H  -4.892168 -0.272075 3.248988
H  -4.202961 -2.197384 4.704618
