program: Gaussian 09
title: 000291509
version: EM64L-G09RevD.01
frameworkgroup: C1[X(C21H23NO6S)]
method: RPBEPBE
basis: SDD
operation: Freq
keyword: #p
keyword: freq=noraman
keyword: PBEPBE/SDD
title: #p freq=noraman PBEPBE/SDD
converged: YES YES NO NO
title: Mulliken charges:
elementType: S O O O O O O N C C C C C C C C C C C C C C C C C C C C C H H H H H H H H H H H H H H H H H H H H H H H
charge: 0.933242 -0.177650 -0.275462 -0.236886 -0.438333 -0.533171 -0.523792 -0.481993 -0.011754 -0.493959 -0.439185 -0.400732 0.180417 -0.529641 0.367336 0.227288 -0.492593 0.209153 0.271415 -0.373719 -0.349805 -0.260046 -0.663482 -0.092252 -0.270631 -0.202366 -0.204744 -0.214007 -0.224200 0.262954 0.219819 0.223813 0.220209 0.209988 0.218994 0.233846 0.276413 0.300332 0.221173 0.230219 0.271921 0.241697 0.208171 0.365015 0.246457 0.232098 0.219336 0.291831 0.298643 0.242242 0.229860 0.236519
chargesum: 0.00000
title: Mulliken charges with hydrogens summed into heavy atoms:
elementType: S O O O O O O N C C C C C C C C C C C C C C C C C C C C C
charge: 0.933242 -0.177650 -0.275462 -0.236886 -0.073317 -0.533171 -0.523792 -0.210072 -0.011754 -0.011185 0.004837 0.028250 0.180417 -0.019382 0.367336 0.227288 -0.192261 0.209153 0.271415 -0.152546 -0.119586 0.189822 0.034409 -0.092252 0.021200 0.096277 0.037498 0.015853 0.012319
polarizability: 3.69607052e+02 -4.90923993e+00 2.55445581e+02 -1.42944812e+01 1.54775201e+01 2.46896746e+02
1716.lowfreq: -10.7637 -6.6513 0.0010 0.0013 0.0017 1.9379 14.7503 17.5953 24.5583
frequency: 14.3557 17.4751 24.3771 35.5623 40.5698 51.0811 57.5575 74.9539 85.5870 86.7511 99.7840 124.2567 132.2156 136.4190 148.5118 155.7129 161.2649 183.4495 192.8382 214.3455 225.0920 238.9415 250.6336 259.8116 288.1063 296.2912 310.6982 332.8813 341.7034 350.7698 373.3309 379.6591 384.7147 397.4909 404.5683 431.3886 434.4431 446.3094 463.9833 474.7456 490.2403 497.6383 512.7862 543.8872 601.9709 605.6060 650.3394 651.7318 670.7598 691.3722 706.8813 715.6560 731.6708 754.2847 762.4479 773.0869 797.5785 800.5346 804.7978 815.1362 835.3010 849.6751 852.3988 859.9401 889.8004 908.9806 916.4276 920.7827 932.7779 933.6792 946.6993 963.8910 976.6244 983.2220 1000.6675 1003.1954 1006.0464 1013.3869 1040.0920 1044.2439 1070.6192 1078.4288 1088.0584 1092.8101 1098.0257 1107.6780 1124.8641 1153.8979 1156.2620 1162.8188 1172.2544 1180.1364 1184.8134 1192.5638 1220.1900 1238.2835 1255.5433 1264.1200 1270.2260 1274.8590 1305.7040 1305.8932 1306.6565 1332.0520 1340.2339 1349.5424 1350.3649 1382.3275 1391.0416 1400.3627 1433.2916 1433.8458 1441.0397 1451.1764 1455.0838 1461.9818 1464.8632 1472.4054 1477.6310 1483.7155 1493.7026 1574.9548 1583.5909 1598.8311 1606.5330 1624.5101 1631.0952 2983.5769 2987.9321 2991.6642 2993.5586 3003.8775 3027.7405 3043.3315 3051.2929 3061.9164 3082.9955 3087.7692 3090.6403 3116.5869 3116.6421 3133.5338 3141.0783 3143.6522 3153.3670 3162.4418 3171.5520 3192.4517 3344.8469 3593.7312
redmass: 5.2317 5.4513 5.6083 3.9630 4.9815 4.8391 3.2306 5.8026 7.4499 5.3548 5.3825 3.7378 4.2946 5.7168 7.1472 5.2980 4.7312 4.7194 4.2112 1.7122 2.7227 8.9956 3.8455 4.6457 3.4908 2.7450 1.3434 6.0616 2.2887 5.4427 10.0467 5.6933 4.6501 2.9119 2.8605 4.0277 7.1062 4.2792 3.4532 3.0335 4.5322 4.2198 3.3317 3.9298 6.4264 4.0678 6.7085 6.0211 3.3153 2.4775 6.0911 3.5901 3.5749 1.4651 4.2367 2.3796 1.5543 2.3821 8.3957 1.5966 2.5311 1.5076 1.2911 2.3570 2.2064 1.6562 2.1592 1.3961 2.6030 1.3456 5.8893 2.4371 6.1647 1.3990 3.1314 1.3361 4.7689 2.9286 2.6220 2.0109 2.3928 1.5894 2.1002 2.0103 1.9926 2.2470 2.2066 1.6351 1.2186 1.8988 1.0594 1.1480 2.2733 1.1922 1.7960 2.6337 1.2803 3.5807 1.3828 1.1278 1.2993 1.2981 1.5117 1.3435 1.4094 1.2973 1.4140 8.7089 1.2324 5.5916 3.3043 2.3647 1.0968 1.9993 1.0975 1.0451 1.0948 1.0880 1.1026 1.0512 2.7394 5.7934 6.7669 6.7936 6.8834 9.6570 9.8896 1.0618 1.0609 1.0631 1.0361 1.0599 1.0582 1.0980 1.1014 1.1034 1.1025 1.0996 1.1025 1.1016 1.0912 1.0855 1.0970 1.0884 1.0931 1.0967 1.1016 1.0917 1.0751 1.0663
irintensity: 1.1439 0.0155 1.9503 0.7160 0.4972 2.0199 0.4131 4.7628 0.6719 0.4142 0.8844 0.9514 1.5080 1.1833 15.4647 2.5329 10.1211 3.9886 12.6601 1.0560 8.5793 6.4503 2.6997 1.9278 11.2286 12.9411 60.4834 15.5813 3.5777 1.2094 4.9097 28.2020 12.8964 2.2460 0.1913 6.7670 25.2589 25.9628 16.5758 15.0925 42.0288 41.2772 12.8390 22.2026 0.1805 7.8904 3.4140 14.0014 3.2030 28.1206 2.7181 4.9224 11.9257 42.3942 19.3210 5.1837 43.7440 7.7555 81.3452 9.6273 2.6866 85.2699 20.4673 6.6482 15.2411 12.6685 12.3694 1.7156 1.0704 0.8945 42.3900 25.7298 4.9947 0.1164 6.2304 0.2932 1.7738 67.1205 7.0860 14.6847 143.7332 5.5665 128.7748 32.3284 27.9846 110.2871 44.2548 8.7340 38.0916 39.1934 0.3522 7.6335 38.8807 4.6307 12.2229 27.2875 12.0430 146.7891 21.6922 4.8908 13.0658 10.0868 9.5113 0.2830 1.3933 0.7243 0.1512 5.8361 27.5362 8.8612 11.6199 14.0322 38.5630 11.1199 11.3265 13.6851 16.0109 27.8134 9.6546 11.5348 73.2139 5.5587 12.4240 0.3830 8.3612 223.8216 138.6498 41.1227 19.4186 21.4696 17.6356 14.4036 30.6380 37.5423 32.2285 27.3000 14.9968 22.0274 8.9614 16.3812 27.4241 1.2422 11.6067 13.8614 2.6745 2.8406 31.2343 0.3740 14.4974 83.1152
temp: 298.150 k
press: 1.00000 atm
elementType: 16 8 8 8 8 8 8 7 6 6 6 6 6 6 6 6 6 6 6 6 6 6 6 6 6 6 6 6 6 1 1 1 1 1 1 1 1 1 1 1 1 1 1 1 1 1 1 1 1 1 1 1
symmnumber: 1
zpe: 1051481.2 jmol-1
zpe.correction: 0.400488 hartree
zpe.thermalcorrener: 0.429455 hartree
zpe.thermalcorrenthalpy: 0.430399 hartree
zpe.thermalcorrgfe: 0.338373 hartree
zpe.sumelectzpe: -1715.880541 hartree
zpe.sumelectthermal: -1715.851574 hartree
zpe.sumelectthermalent: -1715.850630 hartree
zpe.sumelectthermalfe: -1715.942656 hartree
dipole: 0.5259 6.5015 4.3560
dipole: 7.8436
quadrupole: -175.7852 -175.9656 -171.9025
quadrupole: 13.5096 29.7528 -0.8203
quadrupole: -1.2341 -1.4145 2.6486 13.5096 29.7528 -0.8203
hfenergy: -1716.2810291 hartree
pointgroup: C01 [X(C21H23N1O6S1)]
dipole: -0.2861967 -2.0572004 2.2822667 debye
polarizability: 368.8330282|-2.5974914|247.640813|17.3767277|-15.9196931|255.4755379 unknown
InChI: InChI=1S/C21H23NO6S/c1-2-28-20(25)21(13-7-6-10-19(21)24)17-14-15(11-12-18(17)23)22-29(26,27)16-8-4-3-5-9-16/h3-5,8-9,11-12,14,22-23H,2,6-7,10,13H2,1H3
charge 0 multiplicity 1
52 atoms
S  -3.07088 1.128208 -1.700178
O  3.395463 2.153364 1.076866
O  1.283001 -1.852783 0.170529
O  3.581161 -1.772062 0.502149
O  1.822485 0.086939 2.591981
O  -4.406671 1.843365 -2.298524
O  -1.897796 0.517791 -2.649462
N  -2.133652 2.540061 -0.565899
C  2.321698 0.301705 -0.147634
C  2.319642 0.359906 -1.725724
C  3.658475 -0.094585 -2.344168
C  4.824392 0.790634 -1.85082
C  3.551915 1.166533 0.317321
C  4.899346 0.818002 -0.295692
C  1.026633 0.848122 0.461496
C  2.507822 -1.186652 0.236276
C  0.029206 1.475949 -0.297343
C  0.830236 0.760255 1.871124
C  -1.169548 1.967049 0.299958
C  -0.325565 1.284599 2.492041
C  -1.341685 1.858907 1.707648
C  1.311112 -3.322388 0.457035
C  1.617469 -4.117044 -0.814995
C  -3.630373 -0.272445 -0.544758
C  -4.978341 -0.284095 -0.147519
C  -2.682009 -1.227238 -0.136251
C  -5.400878 -1.325269 0.710837
C  -3.125243 -2.253935 0.730468
C  -4.475463 -2.301863 1.1511
H  1.473833 -0.24237 -2.104299
H  2.137665 1.410041 -2.026305
H  3.864083 -1.153879 -2.097166
H  3.579423 -0.032428 -3.446054
H  4.686422 1.823994 -2.226936
H  5.787133 0.42428 -2.252704
H  5.637677 1.558174 0.05725
H  5.189397 -0.186109 0.06586
H  0.124262 1.590035 -1.378491
H  -0.444675 1.214904 3.580586
H  -2.260612 2.225038 2.181319
H  -2.939745 2.966128 -0.064685
H  2.061918 -3.509565 1.244198
H  0.298112 -3.52816 0.840735
H  1.707277 0.190869 3.567853
H  2.64067 -3.908407 -1.169367
H  0.901584 -3.869749 -1.617802
H  1.540941 -5.200274 -0.605763
H  -5.670691 0.476731 -0.523651
H  -1.645892 -1.182556 -0.487393
H  -6.447762 -1.375039 1.02815
H  -2.414941 -3.014576 1.072095
H  -4.809935 -3.105112 1.816709
