program: Gaussian 09
title: 000291470
version: EM64L-G09RevD.01
frameworkgroup: C1[X(C14H16N2O2S)]
method: RPBEPBE
basis: SDD
operation: Freq
keyword: #p
keyword: freq=noraman
keyword: PBEPBE/SDD
title: #p freq=noraman PBEPBE/SDD
converged: YES YES NO NO
title: Mulliken charges:
elementType: S O O N N C C C C C C C C C C C C C C H H H H H H H H H H H H H H H H
charge: 0.913886 -0.543459 -0.544791 -0.416898 -0.145527 0.216949 0.415961 -0.134767 -0.276765 -0.345820 -0.340510 -0.312948 -0.252136 -0.227071 -0.643629 -0.645380 -0.205807 -0.212629 -0.223020 0.244993 0.270527 0.226330 0.244183 0.240608 0.288892 0.284215 0.246503 0.221013 0.243808 0.223580 0.240269 0.242078 0.238044 0.235891 0.233428
chargesum: 0.00000
title: Mulliken charges with hydrogens summed into heavy atoms:
elementType: S O O N N C C C C C C C C C C C C C C
charge: 0.913886 -0.543459 -0.544791 -0.171905 -0.145527 0.216949 0.415961 -0.134767 -0.006237 -0.119490 -0.096327 -0.072340 0.036756 0.057144 0.067695 0.060547 0.032237 0.023261 0.010408
polarizability: 4.14944670e+02 -2.57178928e+01 2.04151066e+02 1.51302337e+01 3.67114364e+00 1.41928726e+02
1716.lowfreq: -13.5477 -3.3992 0.0010 0.0011 0.0019 4.9550 12.7541 20.8885 33.4898
frequency: 9.7669 20.4210 33.4471 46.4657 62.8819 87.1057 100.1282 115.9352 123.7426 149.2976 160.5625 180.0289 188.1441 227.5473 236.4132 258.9133 326.9572 348.0914 366.9489 379.2518 394.4987 403.5851 418.1534 430.4751 480.6796 494.1663 504.8028 537.4942 602.8680 629.3266 647.0048 692.5174 693.7969 735.9244 753.6525 784.8883 788.8852 820.5390 828.9769 851.3107 882.7909 916.2652 929.2616 936.3383 939.1045 962.2588 976.9872 981.0451 985.0767 1000.6823 1005.7574 1042.8719 1053.4320 1073.2804 1101.4101 1109.1354 1111.6294 1157.4136 1164.1698 1170.2811 1174.9964 1192.1009 1251.5346 1284.4072 1299.7575 1324.8442 1368.7113 1382.0556 1383.3266 1430.1792 1432.2611 1448.6338 1455.6582 1462.6488 1464.9669 1477.5000 1490.9502 1499.4550 1519.6466 1533.0112 1575.8381 1597.6166 1621.7094 2953.2888 2960.8423 3023.6777 3029.6670 3102.4110 3113.6067 3117.3714 3131.4041 3141.6812 3151.5073 3160.1706 3164.5006 3167.8324 3170.0242 3187.2112 3297.8366
redmass: 5.6125 4.3341 3.8888 4.9083 3.0053 2.9177 5.1840 9.2023 1.3318 6.0999 5.0339 3.5589 1.3346 3.2958 8.4916 3.4739 6.8233 4.3670 9.1595 3.5580 5.9533 2.8354 4.0002 4.2256 3.4059 4.2622 3.3191 2.3926 6.4701 6.7431 6.8870 4.6645 2.4029 4.0219 1.4197 6.1083 1.4485 3.4244 2.3549 1.2438 1.2817 9.1702 1.3489 3.0791 1.3702 1.3627 6.0610 1.3886 2.8454 1.3415 4.6730 2.0098 1.5143 1.5468 1.2361 1.5270 1.3417 1.2817 1.5908 1.0564 1.1236 1.1425 2.8719 2.8538 1.3035 1.4028 3.0397 8.6929 3.9545 1.1682 2.2071 2.0290 1.2238 3.0448 1.0409 1.0458 1.1834 1.3002 2.0903 5.0788 5.8235 6.8447 5.9639 1.0366 1.0385 1.1004 1.1020 1.0975 1.0951 1.0896 1.0853 1.0882 1.0925 1.0965 1.0876 1.0930 1.1015 1.0969 1.0749
irintensity: 0.4773 0.0207 0.1827 0.0848 0.4311 0.5700 2.4825 62.9415 4.7644 12.3900 6.4407 10.8660 3.4298 0.7711 6.5788 24.3430 1.6680 26.8275 10.8949 12.8040 27.7612 0.0897 7.8213 15.0728 5.1856 104.3285 4.6384 9.4898 0.0050 1.8718 0.8986 11.3474 27.5874 3.3242 47.2739 89.4777 36.3326 20.6977 47.7205 1.2326 91.7146 34.7257 4.6766 28.6684 2.2285 1.2647 10.6344 0.2294 0.8279 1.2206 4.5197 16.0721 25.3338 6.4476 0.2350 2.6945 1.3616 15.6745 2.2538 0.0785 23.0902 107.9383 22.2395 50.1001 3.1028 3.7675 237.7858 6.7389 42.9213 6.7306 13.4636 16.2638 18.9728 2.2493 0.0507 25.0474 1.2449 19.9649 190.6273 24.0241 25.6583 1.1272 541.5400 83.5783 153.6883 20.9594 44.6273 3.7537 43.4692 4.6305 0.6678 10.4943 1.8476 7.1724 9.6756 16.3145 42.6711 6.9666 18.7794
temp: 298.150 k
press: 1.00000 atm
elementType: 16 8 8 7 7 6 6 6 6 6 6 6 6 6 6 6 6 6 6 1 1 1 1 1 1 1 1 1 1 1 1 1 1 1 1
symmnumber: 1
zpe: 711536.6 jmol-1
zpe.correction: 0.271010 hartree
zpe.thermalcorrener: 0.290632 hartree
zpe.thermalcorrenthalpy: 0.291576 hartree
zpe.thermalcorrgfe: 0.219531 hartree
zpe.sumelectzpe: -1199.528738 hartree
zpe.sumelectthermal: -1199.509116 hartree
zpe.sumelectthermalent: -1199.508172 hartree
zpe.sumelectthermalfe: -1199.580217 hartree
dipole: -7.0566 8.1289 1.6540
dipole: 10.8908
quadrupole: -88.0612 -124.0556 -120.9731
quadrupole: 11.1865 11.9540 0.2872
quadrupole: 22.9687 -13.0256 -9.9431 11.1865 11.9540 0.2872
hfenergy: -1199.7997484 hartree
pointgroup: C01 [X(C14H16N2O2S1)]
dipole: 3.0351317 -2.8603025 0.9828363 debye
polarizability: 418.2364913|-7.7352954|199.7370916|-9.4046737|-10.754876|143.0508791 unknown
InChI: InChI=1S/C8H11N2.C6H5O2S/c1-10(2)8-5-3-7(9)4-6-8;7-9(8)6-4-2-1-3-5-6/h3-6,9H,1-2H3;1-5H
charge 0 multiplicity 1
35 atoms
S  -2.105595 1.335164 -0.460244
O  -3.442994 2.257302 -0.260539
O  -1.215729 1.386604 -1.83926
N  -0.631034 1.825741 1.130063
N  4.476658 -0.253081 -0.160699
C  0.597385 1.241577 0.823814
C  3.207794 0.225421 0.150827
C  -2.682991 -0.475209 -0.292484
C  1.39727 1.86512 -0.191049
C  1.124853 0.067317 1.45968
C  2.660282 1.371716 -0.522309
C  2.401855 -0.412486 1.157728
C  -3.877071 -0.726369 0.406023
C  -1.891697 -1.484759 -0.868225
C  5.276691 0.398534 -1.210755
C  5.028226 -1.416688 0.551348
C  -4.295033 -2.07143 0.536771
C  -2.324231 -2.824163 -0.723875
C  -3.51774 -3.115054 -0.020752
H  -1.100981 1.344495 1.929142
H  0.98796 2.742475 -0.699027
H  0.518618 -0.447697 2.216569
H  3.23342 1.877337 -1.303398
H  2.778657 -1.289692 1.690273
H  -4.469667 0.106866 0.798939
H  -0.990684 -1.223063 -1.43273
H  4.758737 0.375661 -2.189449
H  6.235904 -0.129969 -1.320701
H  5.494674 1.455512 -0.960707
H  6.047562 -1.617887 0.188272
H  4.419761 -2.327617 0.383591
H  5.084949 -1.235574 1.642788
H  -5.227379 -2.300553 1.064063
H  -1.735039 -3.634365 -1.166927
H  -3.84889 -4.154288 0.082741
