program: Gaussian 09
title: 000291480
version: EM64L-G09RevD.01
frameworkgroup: C1[X(C17H18INO4S)]
method: RPBEPBE
basis: SDD
operation: Freq
keyword: #p
keyword: freq=noraman
keyword: PBEPBE/SDD
title: #p freq=noraman PBEPBE/SDD
converged: YES YES NO NO
title: Mulliken charges:
elementType: I S O O O O N C C C C C C C C C C C C C C C C C H H H H H H H H H H H H H H H H H H
charge: 0.077300 0.887370 -0.524081 -0.524140 -0.411933 -0.243159 -0.431893 0.045714 0.474041 0.468069 -0.463748 0.605758 -0.679821 -0.669238 0.008123 -0.849477 -0.827619 -0.841333 -0.244706 -0.274696 0.226105 -0.218458 -0.204606 -0.217558 0.306996 0.266337 0.243751 0.254521 0.247798 0.301941 0.224636 0.230974 0.285873 0.255494 0.257626 0.235187 0.317012 0.298055 0.243965 0.242415 0.237187 0.384215
chargesum: 0.00000
title: Mulliken charges with hydrogens summed into heavy atoms:
elementType: I S O O O O N C C C C C C C C C C C C C C C C C
charge: 0.077300 0.887370 -0.524081 -0.524140 -0.027717 -0.243159 -0.431893 0.045714 0.474041 0.468069 0.109585 0.605758 -0.679821 -0.425487 0.008123 -0.045217 -0.086136 -0.093026 0.072305 0.023360 0.226105 0.025507 0.037808 0.019629
polarizability: 2.96416064e+02 -5.72468425e+00 2.84051167e+02 1.44707268e+01 2.49653905e+01 2.08197195e+02
1716.lowfreq: -4.1925 -0.0009 -0.0007 0.0011 2.5142 8.9876 17.7535 22.9959 32.7404
frequency: 17.6610 22.8039 32.6984 38.5997 52.2026 57.2484 65.3941 74.0430 86.3740 110.2753 130.7034 148.8230 158.7744 178.5902 187.6506 194.1410 198.2605 203.5698 207.0684 231.3669 239.4197 249.0615 265.4939 285.7244 307.0124 328.1894 341.3998 355.8873 382.0502 385.7734 402.6735 446.1237 465.5662 481.3869 505.5301 516.2705 537.0913 542.9689 564.6023 590.9949 601.6682 612.7758 627.2794 640.1628 657.5204 686.8922 757.2883 760.2982 763.0140 798.8388 848.8442 851.8711 875.2141 923.1404 939.1475 940.5575 952.9687 975.0787 978.7281 987.1270 1005.8808 1007.4976 1017.5853 1021.8423 1031.5051 1041.8352 1044.4080 1044.9269 1047.5134 1051.8274 1060.6125 1082.5815 1173.4267 1186.7830 1197.8384 1235.7225 1263.3817 1297.3884 1312.8348 1314.9554 1328.0755 1366.5983 1376.9618 1383.0783 1394.1761 1397.2194 1400.8039 1403.1809 1405.4319 1437.4817 1455.7856 1457.4618 1462.9153 1470.4895 1477.9807 1480.8035 1487.9412 1540.2425 1575.4619 1588.0863 1602.3184 1670.7762 2920.4686 2980.4549 2983.9370 2984.4804 3057.4104 3059.2891 3066.1257 3067.2569 3089.8150 3091.0369 3122.8356 3129.7783 3137.9098 3150.1323 3158.5931 3167.1369 3175.4137 3517.9123
redmass: 7.0916 7.9049 5.0767 4.5679 5.8051 7.8741 3.9972 3.4189 3.9836 3.0968 2.3061 4.8579 2.9071 1.5251 1.5007 3.5763 3.6872 3.6553 2.7633 5.9753 6.9310 5.3764 3.3713 3.4947 2.8148 4.9589 4.6184 4.1645 8.3707 4.8775 2.8696 3.6454 3.2027 3.5000 5.1342 4.5259 4.3998 3.1429 3.9972 4.3200 6.4427 3.9288 4.7926 1.5543 7.1996 2.4691 3.8490 2.8557 1.8515 14.1443 2.8427 1.5520 1.2926 14.5567 1.4849 2.4827 3.2096 4.2294 2.6694 1.4728 1.3369 4.4475 1.7988 3.1978 2.3386 1.5375 1.5462 1.5742 2.0537 1.6837 2.6276 1.5990 1.0630 1.1239 2.8179 1.3889 2.0814 1.4028 2.6626 1.7485 6.3416 1.6959 3.5666 8.0290 1.2453 1.9395 1.2454 1.2288 1.2137 2.2464 1.3292 1.6050 1.0449 1.1681 1.1011 1.0566 1.0814 5.9138 5.6821 6.0068 6.8401 8.6974 1.0670 1.0372 1.0390 1.0375 1.0966 1.0968 1.0945 1.0926 1.0986 1.0995 1.0969 1.0915 1.0860 1.0889 1.0932 1.0969 1.1016 1.0642
irintensity: 0.2979 0.5847 0.3974 0.0708 0.0714 2.5623 2.1544 0.5444 1.0363 1.3708 1.8140 0.3361 0.8335 1.8796 1.4515 1.8829 1.9108 2.8521 5.5144 1.3663 8.1787 5.6030 8.0243 0.4823 1.3847 5.5082 2.0010 0.8755 22.8095 14.7853 0.5854 42.4288 29.6913 35.5063 72.3701 63.0593 12.7915 3.4001 2.6681 22.1121 1.7990 32.7465 0.9237 92.6460 8.0614 35.5985 14.8913 28.1612 46.9950 79.0095 3.0669 3.0063 8.7210 55.4086 5.5018 12.4405 66.3763 5.3504 8.3211 1.7546 0.4198 1.5655 7.1995 221.7106 82.9260 1.8953 3.8820 17.0918 15.2666 5.2891 135.2137 7.5181 1.3803 8.3588 8.2436 3.0913 33.5836 4.3758 6.0970 3.0935 6.0736 16.4109 30.4284 5.8261 6.8492 4.4967 22.8425 4.4410 57.3458 15.8399 25.1281 14.4004 13.3824 32.1698 14.5205 19.0116 21.6903 10.8813 4.5204 19.8480 1.3878 180.1610 32.8396 18.5310 14.6155 22.0516 11.0300 8.0120 6.6552 7.7117 12.2107 22.8927 1.4118 20.3245 2.7054 21.3961 1.8849 0.8750 38.4620 35.2830
temp: 298.150 k
press: 1.00000 atm
elementType: 53 16 8 8 8 8 7 6 6 6 6 6 6 6 6 6 6 6 6 6 6 6 6 6 1 1 1 1 1 1 1 1 1 1 1 1 1 1 1 1 1 1
symmnumber: 1
zpe: 820826.6 jmol-1
zpe.correction: 0.312636 hartree
zpe.thermalcorrener: 0.338211 hartree
zpe.thermalcorrenthalpy: 0.339155 hartree
zpe.thermalcorrgfe: 0.254151 hartree
zpe.sumelectzpe: -1421.905217 hartree
zpe.sumelectthermal: -1421.879642 hartree
zpe.sumelectthermalent: -1421.878698 hartree
zpe.sumelectthermalfe: -1421.963702 hartree
dipole: -1.7982 0.6655 2.0506
dipole: 2.8074
quadrupole: -172.8391 -139.4469 -159.9188
quadrupole: 9.7846 16.7188 -3.4727
quadrupole: -15.4375 17.9547 -2.5172 9.7846 16.7188 -3.4727
hfenergy: -1422.2178537 hartree
pointgroup: C01 [X(C17H18I1N1O4S1)]
dipole: -0.4373588 0.0127725 1.0141353 debye
polarizability: 296.6444056|5.5627382|268.2317042|-13.0406156|39.9696473|223.7883164 unknown
InChI: InChI=1S/C17H18INO4S/c1-11-9-12(2)17(13(3)16(11)18)19(10-15(20)21)24(22,23)14-7-5-4-6-8-14/h4-9,20H,10H2,1-3H3
charge 0 multiplicity 1
42 atoms
I  -4.187082 0.610426 2.241113
S  1.296219 0.279671 -1.542703
O  0.252166 0.401451 -2.792581
O  2.81644 -0.266275 -1.799035
O  2.881369 -3.058106 1.768887
O  2.64749 -0.75331 1.935597
N  0.611453 -0.889986 -0.11647
C  -0.809626 -1.078519 -0.137762
C  -1.578392 -0.338778 0.828879
C  -1.449117 -1.958415 -1.070735
C  1.529999 -2.012859 0.091864
C  -3.654866 -1.388313 -0.074284
C  -2.986118 -0.514748 0.821948
C  -2.850277 -2.097268 -1.002292
C  1.352266 1.974612 -0.71365
C  -0.88734 0.565007 1.82669
C  -0.679481 -2.707371 -2.143831
C  -5.155747 -1.583826 -0.08608
C  2.187715 2.149877 0.401338
C  0.567502 2.986849 -1.287932
C  2.375967 -1.822251 1.351712
C  2.236291 3.44319 0.971203
C  0.633453 4.271394 -0.699077
C  1.465541 4.496726 0.422722
H  2.257034 -2.094969 -0.749078
H  0.994951 -2.973983 0.168609
H  -3.349594 -2.768652 -1.710383
H  -1.15985 1.623667 1.656664
H  -1.199189 0.319544 2.858411
H  0.203871 0.463091 1.745462
H  0.035768 -3.438771 -1.724833
H  -1.372065 -3.265066 -2.795959
H  -0.111678 -2.004736 -2.779581
H  -5.523119 -1.943905 0.892866
H  -5.682961 -0.633118 -0.289137
H  -5.4512 -2.314246 -0.857358
H  2.747954 1.312318 0.828489
H  -0.060465 2.772822 -2.158559
H  2.871058 3.620781 1.845361
H  0.037521 5.088803 -1.117983
H  1.511557 5.494523 0.872496
H  3.48538 -2.928775 2.549684
