program: Gaussian 09
title: 000291468
version: EM64L-G09RevD.01
frameworkgroup: C1[X(C14H16N2O2S)]
method: RPBEPBE
basis: SDD
operation: Freq
keyword: #p
keyword: freq=noraman
keyword: PBEPBE/SDD
title: #p freq=noraman PBEPBE/SDD
converged: YES YES NO NO
title: Mulliken charges:
elementType: S O O N N C C C C C C C C C C C C C C H H H H H H H H H H H H H H H H
charge: 0.890426 -0.533176 -0.528698 -0.510910 -0.051184 0.044362 0.454180 0.047234 -0.029618 -0.436760 0.157649 -0.822092 -0.813997 -0.259742 -0.221741 -0.785427 -0.202590 -0.215297 -0.215966 0.296403 0.241303 0.220271 0.256549 0.262335 0.266377 0.223667 0.268206 0.288218 0.269189 0.233478 0.227703 0.255842 0.242891 0.242082 0.238833
chargesum: 0.00000
title: Mulliken charges with hydrogens summed into heavy atoms:
elementType: S O O N N C C C C C C C C C C C C C C
charge: 0.890426 -0.533176 -0.528698 -0.214507 -0.051184 0.044362 0.454180 0.047234 -0.029618 -0.195456 0.157649 -0.082936 -0.055748 0.028476 0.047448 -0.068405 0.040302 0.026786 0.022867
polarizability: 3.44943158e+02 1.04148998e+01 2.03966077e+02 -8.31300186e+00 -8.33513087e+00 1.19591073e+02
1716.lowfreq: -42.3435 -11.9843 -5.8753 -2.2002 -0.0015 -0.0013 -0.0009 15.1774 30.6817
frequency: -42.3427 15.0202 30.6440 40.5588 55.7374 73.5781 110.3434 139.3480 160.9622 162.9423 167.8061 176.0024 177.4518 209.3072 236.0783 244.3097 275.6670 293.6140 329.6418 347.7763 370.0733 404.0962 405.4467 424.2038 487.0640 501.5561 515.3537 530.6173 547.7268 577.7824 602.8936 606.5772 656.2998 690.9979 756.3935 759.9733 780.3178 797.8918 849.5680 862.0012 888.4548 906.4231 933.1686 936.4480 954.5515 977.8310 982.7700 1004.2662 1008.5450 1014.0489 1019.8096 1038.2972 1039.5222 1047.4717 1049.8993 1051.6242 1077.7129 1161.6276 1173.3546 1177.9987 1211.8297 1262.9021 1302.3262 1318.6471 1343.9432 1378.7234 1384.2820 1385.9946 1388.6333 1394.1831 1400.9551 1435.5379 1451.0172 1452.6366 1457.9997 1467.8778 1472.4141 1476.9512 1480.3934 1548.2894 1577.5558 1578.7120 1603.0672 2969.0361 2979.5805 2982.2727 3047.8746 3058.9264 3064.7685 3096.8450 3118.9637 3120.0992 3134.6274 3137.9809 3148.5901 3157.9785 3167.4030 3176.0520 3334.1333
redmass: 1.0232 4.5315 5.0019 4.1808 4.4827 5.6100 5.7365 6.3342 1.8781 1.9968 1.3474 3.3858 2.2364 4.0892 5.2684 8.6534 2.4989 2.6209 6.0660 3.6362 9.0771 3.7231 3.9031 7.3486 4.1138 4.2008 4.7480 3.3413 3.6810 4.2119 6.4735 4.0487 6.9229 2.3616 4.0614 1.4524 5.0060 15.6750 1.2448 1.7173 1.2884 3.4303 1.3608 3.6507 2.2035 6.1626 1.3947 1.3363 4.2212 1.6739 1.9764 1.5718 1.7105 2.0873 1.6007 1.6045 1.5475 2.9169 1.0553 1.1232 1.8442 1.5345 1.3041 5.1145 4.1620 2.4076 7.5249 2.0194 1.2726 1.6783 1.6608 2.2370 1.2321 1.6577 1.1038 1.0498 1.1382 1.0614 1.1084 4.8772 5.8181 5.7659 6.8960 1.0414 1.0373 1.0384 1.0955 1.0969 1.0948 1.1008 1.0980 1.0965 1.0925 1.0857 1.0886 1.0928 1.0964 1.1012 1.0736
irintensity: 0.4393 0.6192 0.6012 0.3143 0.6663 1.1192 5.1831 7.5120 4.8123 6.1059 1.7122 3.3882 1.1688 11.2622 24.1357 6.3582 2.2992 0.7964 2.4103 8.5065 9.8642 2.9780 4.1264 103.7358 6.6232 60.0144 10.9919 13.5460 5.8212 2.6914 0.0156 9.0535 6.2474 32.6761 5.0824 71.3786 1.0519 63.1704 0.1495 67.4439 11.9159 30.3736 1.8057 21.9828 35.2525 4.8221 0.7910 0.6274 2.1117 2.0838 6.2031 7.4443 2.8934 25.9864 5.1838 8.4450 5.3727 7.6208 0.0323 13.4440 3.3109 4.2384 3.3897 40.2330 12.5952 5.7182 6.1878 6.0943 38.0649 46.9649 1.3307 14.0095 34.9983 16.1734 17.4135 13.6920 23.1746 23.0898 49.0401 40.3118 64.6151 101.5427 0.6162 12.0281 11.3213 19.9926 9.8635 16.8956 12.2630 14.3078 9.3183 9.0318 17.9628 0.7539 9.2776 1.5781 5.8079 33.8019 13.3682
temp: 298.150 k
press: 1.00000 atm
elementType: 16 8 8 7 7 6 6 6 6 6 6 6 6 6 6 6 6 6 6 1 1 1 1 1 1 1 1 1 1 1 1 1 1 1 1
symmnumber: 1
zpe: 707516.1 jmol-1
zpe.correction: 0.269479 hartree
zpe.thermalcorrener: 0.288550 hartree
zpe.thermalcorrenthalpy: 0.289494 hartree
zpe.thermalcorrgfe: 0.220413 hartree
zpe.sumelectzpe: -1199.552517 hartree
zpe.sumelectthermal: -1199.533446 hartree
zpe.sumelectthermalent: -1199.532502 hartree
zpe.sumelectthermalfe: -1199.601583 hartree
dipole: 2.4644 -3.2864 -3.5750
dipole: 5.4456
quadrupole: -97.1377 -112.9510 -129.5211
quadrupole: 2.2129 -7.1451 -6.9777
quadrupole: 16.0655 0.2523 -16.3178 2.2129 -7.1451 -6.9777
hfenergy: -1199.8219955 hartree
pointgroup: C01 [X(C14H16N2O2S1)]
dipole: -1.0075151 1.3868685 -1.2851664 debye
polarizability: 344.709902|12.3868958|202.4174171|6.6065276|15.1785434|121.372989 unknown
InChI: InChI=1S/C14H16N2O2S/c1-10-9-11(2)15-12(3)14(10)16-19(17,18)13-7-5-4-6-8-13/h4-9,16H,1-3H3
charge 0 multiplicity 1
35 atoms
S  -1.00822 -0.823785 0.780802
O  -1.162964 -2.452802 0.881993
O  -0.459837 0.062224 2.034747
N  0.162891 -0.353278 -0.850549
N  3.852939 -0.6861 -0.30935
C  1.497553 -0.032309 -0.49871
C  1.816973 1.32121 -0.149085
C  2.552019 -1.011106 -0.548248
C  -2.68855 -0.140616 0.2572
C  3.173092 1.61998 0.099043
C  4.16532 0.610737 0.01751
C  0.746139 2.380581 -0.048434
C  2.262924 -2.463486 -0.872185
C  -3.589809 -1.031054 -0.348461
C  -2.975122 1.208902 0.518795
C  5.621121 0.907276 0.303202
C  -4.856525 -0.526254 -0.724133
C  -4.247363 1.693371 0.137149
C  -5.179799 0.830543 -0.486687
H  0.109331 -1.281804 -1.318384
H  3.465075 2.64276 0.362315
H  1.168982 3.391131 -0.178581
H  -0.043238 2.209496 -0.800752
H  0.268583 2.330739 0.948858
H  1.512598 -2.893779 -0.182316
H  1.884222 -2.595753 -1.905652
H  3.198938 -3.033961 -0.781078
H  -3.318582 -2.082012 -0.491775
H  -2.245024 1.847578 1.025516
H  5.76176 1.248493 1.346276
H  6.005121 1.708705 -0.355562
H  6.220932 -0.001971 0.146204
H  -5.586755 -1.192711 -1.194629
H  -4.508149 2.739019 0.330594
H  -6.163376 1.213839 -0.778932
