program: Gaussian 09
title: 000291453
version: EM64L-G09RevD.01
frameworkgroup: C1[X(C10H13NO3)]
method: RPBEPBE
basis: SDD
operation: Freq
keyword: #p
keyword: freq=noraman
keyword: PBEPBE/SDD
title: #p freq=noraman PBEPBE/SDD
converged: YES YES NO NO
title: Mulliken charges:
elementType: O O O N C C C C C C C C C C H H H H H H H H H H H H H
charge: -0.232013 -0.256481 -0.269247 -0.425291 0.226846 0.015166 0.349354 0.162908 -0.419405 -0.787089 0.135418 -0.799300 -0.258479 -0.659743 0.312949 0.253185 0.253873 0.204470 0.308144 0.238895 0.237629 0.260624 0.228317 0.217939 0.205263 0.252130 0.243938
chargesum: 0.00000
title: Mulliken charges with hydrogens summed into heavy atoms:
elementType: O O O N C C C C C C C C C C
charge: -0.232013 -0.256481 -0.269247 -0.112342 0.226846 0.015166 0.349354 0.162908 -0.166220 -0.020603 0.135418 -0.062152 0.187777 0.041589
polarizability: 1.75007177e+02 -9.87086053e+00 1.32697710e+02 -1.66718287e+00 -5.09420691e-01 7.67224454e+01
1716.lowfreq: -5.5805 -0.0011 -0.0009 -0.0006 7.0501 10.9642 33.6610 51.6756 54.3085
frequency: 33.3708 51.6672 54.2343 62.8290 82.7996 101.5526 150.1838 169.0318 192.4581 206.3392 216.6723 276.2342 285.9233 313.4578 359.8362 404.2325 433.6418 509.9774 536.9442 551.7275 578.1549 584.9373 600.1931 617.1572 694.9044 735.1440 773.7857 821.0423 832.3280 868.9955 944.9693 971.3461 996.3663 1026.2665 1046.5615 1050.1511 1050.7701 1074.9839 1097.0482 1157.0138 1162.2051 1210.7567 1270.6859 1274.3185 1329.6218 1350.9450 1356.2128 1392.4267 1402.8114 1405.3419 1447.1627 1456.5153 1458.4716 1459.7273 1468.1228 1484.2471 1487.6836 1497.2002 1545.6884 1595.6507 1605.4865 1660.8763 2975.8957 2985.6289 2994.4146 3026.6593 3050.3432 3066.9638 3089.3335 3097.4712 3115.0445 3115.5603 3121.1508 3174.8046 3544.4389
redmass: 3.1421 3.7971 1.3714 3.1582 2.9818 1.0975 3.0681 2.8258 3.2497 1.7120 2.9623 2.4878 5.6988 3.4104 4.1083 5.2869 4.0501 5.6700 4.0872 4.6522 4.6062 3.8037 4.6769 1.2678 5.6642 3.2989 3.5215 1.4118 3.6297 1.5251 1.8203 4.5678 2.6821 1.5834 1.7886 1.5950 3.1065 2.5226 2.1483 1.6817 3.9495 1.9904 4.5668 1.1566 2.6383 1.4242 1.9174 1.2235 1.2866 1.2390 1.2157 1.1052 1.1224 1.0849 1.0436 1.0834 1.1917 1.8965 8.5578 8.2307 3.7897 6.6822 1.0394 1.0389 1.0367 1.0594 1.0981 1.0984 1.0996 1.1013 1.0963 1.0970 1.1048 1.0932 1.0775
irintensity: 4.5867 6.9817 1.4827 1.3228 0.6338 0.0141 1.6921 0.2536 1.0595 0.7652 0.1746 0.5818 0.6805 17.3555 6.1067 2.0772 2.7250 2.7730 1.4231 1.7029 4.2033 12.1477 6.3385 63.2235 11.2323 7.8219 1.0571 4.8487 0.7897 28.6422 2.0196 1.7473 2.9966 5.4621 70.3281 18.2070 157.1934 91.2487 19.0810 20.4575 104.2834 18.2447 91.2503 1.0725 1.8978 7.8073 8.3443 27.7544 34.1940 45.3283 94.4743 13.6690 23.7476 22.2002 17.4465 4.0162 75.7178 81.5449 142.4597 148.8177 122.0409 244.6258 27.6863 28.6179 21.5243 40.3718 16.8425 21.8518 23.7662 16.5386 8.8989 0.2877 28.2857 3.9252 49.7797
temp: 298.150 k
press: 1.00000 atm
elementType: 8 8 8 7 6 6 6 6 6 6 6 6 6 6 1 1 1 1 1 1 1 1 1 1 1 1 1
symmnumber: 1
zpe: 563411.8 jmol-1
zpe.correction: 0.214592 hartree
zpe.thermalcorrener: 0.229647 hartree
zpe.thermalcorrenthalpy: 0.230591 hartree
zpe.thermalcorrgfe: 0.171199 hartree
zpe.sumelectzpe: -668.246043 hartree
zpe.sumelectthermal: -668.230988 hartree
zpe.sumelectthermalent: -668.230044 hartree
zpe.sumelectthermalfe: -668.289436 hartree
dipole: -5.3697 3.6176 1.7571
dipole: 6.7088
quadrupole: -54.7565 -85.4110 -85.9719
quadrupole: -4.2329 3.0997 1.8229
quadrupole: 20.6233 -10.0312 -10.5921 -4.2329 3.0997 1.8229
hfenergy: -668.4606348 hartree
pointgroup: C01[X(C10H13N1O3)]
dipole: 1.9754771 -1.7173033 -0.3392826 debye
polarizability: 172.9700419|-12.501763|115.1977009|-5.3999848|27.3634029|96.2595902 unknown
InChI: InChI=1S/C10H13NO3/c1-4-14-10(13)9-7(3)11-6(2)5-8(9)12/h5,11H,4H2,1-3H3
charge 0 multiplicity 1
27 atoms
O  -2.205229 -0.432757 1.108588
O  -0.334282 1.766654 1.265291
O  -2.082467 -0.821792 -1.18593
N  2.209755 -1.102862 -0.237814
C  0.844939 -1.277984 -0.444719
C  -0.050405 -0.374391 0.120509
C  2.747093 -0.056724 0.522689
C  0.431009 0.825038 0.864557
C  1.888528 0.872158 1.066859
C  0.456904 -2.500123 -1.250296
C  -1.519427 -0.561297 -0.088143
C  4.250923 -0.041062 0.665041
C  -3.697406 -0.363157 1.032638
C  -4.13704 1.074373 0.740569
H  2.847741 -1.782877 -0.655473
H  2.282319 1.706325 1.653692
H  0.154152 -3.329702 -0.584166
H  1.296393 -2.854134 -1.876209
H  -0.398523 -2.267464 -1.902051
H  4.751217 0.051239 -0.318302
H  4.623019 -0.964673 1.148912
H  4.56544 0.813209 1.283291
H  -4.049705 -1.066283 0.256977
H  -4.018586 -0.700808 2.03092
H  -5.237582 1.152954 0.819789
H  -3.675654 1.770734 1.460138
H  -3.838522 1.377104 -0.276956
