program: Gaussian 09
title: 000291517
version: EM64L-G09RevD.01
frameworkgroup: C1[X(C23H18N2O4S2)]
method: RPBEPBE
basis: SDD
operation: Freq
keyword: #p
keyword: freq=noraman
keyword: PBEPBE/SDD
title: #p freq=noraman PBEPBE/SDD
converged: YES YES NO NO
title: Mulliken charges:
elementType: S S O O O O N N C C C C C C C C C C C C C C C C C C C C C C C H H H H H H H H H H H H H H H H H H
charge: 0.869475 0.844627 -0.519624 -0.520139 -0.527028 -0.515440 -0.309709 -0.304009 0.240086 0.256915 -0.089750 0.505611 -0.002561 -0.470824 -0.348076 -0.351997 -0.817908 -0.227521 -0.228029 0.015991 0.013288 -0.254849 -0.251001 -0.254553 -0.256104 -0.204856 -0.205251 -0.203643 -0.202285 -0.216910 -0.216214 0.293905 0.293460 0.290578 0.247447 0.278143 0.281269 0.239231 0.240298 0.286137 0.285080 0.285109 0.286383 0.242283 0.242345 0.242090 0.242268 0.238321 0.237941
chargesum: 0.00000
title: Mulliken charges with hydrogens summed into heavy atoms:
elementType: S S O O O O N N C C C C C C C C C C C C C C C C C C C C C C C
charge: 0.869475 0.844627 -0.519624 -0.520139 -0.527028 -0.515440 -0.309709 -0.304009 0.240086 0.256915 -0.089750 0.505611 -0.002561 -0.176919 -0.054616 -0.061419 -0.011050 0.011710 0.012269 0.015991 0.013288 0.031289 0.034079 0.030556 0.030279 0.037427 0.037094 0.038447 0.039983 0.021411 0.021727
polarizability: 6.08548146e+02 4.02428364e+00 3.06291014e+02 1.01735392e+00 3.53824387e+00 2.35314236e+02
1716.lowfreq: -6.6084 -3.0489 -1.1993 -0.0019 -0.0019 0.0006 3.4996 7.9644 21.1597
frequency: -3.5810 7.9071 20.9137 27.4216 30.8967 41.5981 52.8480 58.4837 76.2217 78.7544 112.2335 130.9194 140.1681 144.8208 150.9530 161.3101 166.7818 186.0799 199.8166 202.7652 247.3285 253.0535 259.8298 276.4041 286.0500 312.9577 347.5111 356.9844 358.9718 363.6818 365.4248 393.7010 403.6173 404.7621 409.4399 442.6295 448.1962 455.7617 480.9909 493.7837 500.2606 508.7601 544.8305 580.3228 602.2552 602.3933 642.4621 644.1713 658.7313 661.8613 675.1932 690.8331 691.6926 692.6214 715.9853 761.9113 762.5647 788.9392 798.0178 805.0004 811.3827 818.6952 850.7839 852.8396 878.7523 919.7727 923.4451 929.1446 929.6507 934.6485 936.0209 978.1996 978.4876 983.1624 984.5138 995.7103 1004.6071 1005.0513 1009.6583 1009.6807 1014.7055 1028.7840 1037.1293 1051.3940 1051.6386 1051.9759 1077.8599 1077.9784 1089.3960 1120.5635 1172.8995 1173.0662 1173.2519 1178.3678 1178.7591 1181.5622 1252.1805 1259.2319 1304.1321 1304.4951 1320.8093 1370.8781 1384.2014 1384.2210 1393.8979 1414.2681 1424.2231 1436.4063 1436.7885 1441.6434 1453.3986 1453.6782 1464.7178 1473.8395 1477.0726 1495.2073 1576.1172 1578.6280 1578.7601 1605.5448 1605.7093 1606.6090 1617.2710 2971.1285 3047.6585 3099.5779 3138.0728 3138.2469 3139.5537 3149.3583 3149.8493 3154.9313 3156.5659 3157.7626 3159.0540 3166.9626 3167.9611 3171.2084 3175.9727 3176.4003 3179.4151
redmass: 6.4743 6.2272 3.9410 6.1515 4.1927 6.5131 6.4158 6.8649 8.5695 6.7349 5.4182 7.9981 5.0113 7.6897 6.4736 8.2196 7.1911 5.9434 4.8218 5.3016 8.7622 8.0866 6.3212 4.5605 1.2079 3.6792 4.5513 7.5946 7.8121 10.4946 6.4701 6.9252 2.8331 2.8275 6.8084 6.5481 4.1142 8.6857 6.1938 4.6746 3.5778 5.3896 9.7517 8.9850 6.4766 6.4731 5.1398 3.5953 6.8331 7.0861 6.4560 4.1997 2.3544 2.3298 6.5886 1.4518 1.4591 1.3061 15.7920 14.1450 4.7504 3.0907 1.2440 1.2432 1.6687 8.1974 1.7873 8.3807 6.7183 1.3909 1.3740 6.2572 6.1943 1.3867 1.3894 1.3860 1.3371 1.3379 3.9561 3.9866 1.3585 2.0301 2.1299 1.5954 2.1530 2.2051 1.5490 1.5447 2.2910 2.5736 1.0548 1.0554 1.1772 1.1247 1.1311 1.8886 1.6586 3.1162 1.2966 1.2959 3.6980 1.7348 8.3294 8.4302 10.5200 1.2472 2.4016 2.2616 2.2652 8.4960 2.0319 2.0358 1.0394 2.3186 1.9127 2.0617 6.6611 5.8454 5.8423 6.9561 6.9644 6.5674 5.7932 1.0389 1.0972 1.0979 1.0859 1.0859 1.0867 1.0886 1.0887 1.0922 1.0915 1.0928 1.0928 1.0970 1.0968 1.0953 1.1016 1.1015 1.0986
irintensity: 0.9388 0.0466 0.2440 0.9116 0.2174 1.2316 3.3061 0.1621 0.6158 1.4330 0.0279 1.4239 2.1388 1.2760 4.5171 8.5796 4.5568 0.3738 3.7724 20.0080 10.6896 11.2221 0.0857 1.0934 3.4373 1.0958 0.3178 27.3859 3.2518 26.5168 4.3719 10.3744 0.0044 0.0042 82.5473 120.9042 7.8505 306.0365 0.2015 34.4149 2.0146 242.4851 38.6976 12.0810 0.0008 0.0001 12.2374 11.5700 17.5336 12.5554 17.5948 5.7513 34.1803 39.5271 17.2189 65.2440 81.4764 63.7817 65.6905 65.2457 29.2335 0.5768 0.7463 0.6965 0.5762 54.6079 8.7113 66.9509 41.9632 1.0133 1.0440 9.0632 3.0855 0.0187 0.0116 1.7768 0.4744 0.4887 5.3668 0.1224 0.0080 22.0294 10.3010 8.6584 41.2125 21.6008 3.6041 5.4066 27.1566 1.3574 0.0313 0.0156 7.9488 38.2380 0.2145 3.1348 40.4792 59.9136 3.2345 3.3438 36.6638 45.4377 4.1786 6.9221 9.9520 55.6814 30.6719 15.8524 16.7063 12.7005 26.3358 18.4191 21.1933 12.0488 97.3827 433.8934 22.4570 15.1056 0.9923 0.2792 0.4346 8.8681 44.7429 22.7908 0.2086 8.2478 1.0634 0.9689 3.0966 10.8862 11.7425 1.9122 12.4444 2.1591 3.0433 3.3020 2.3686 3.2366 40.0437 30.0402 15.4674
temp: 298.150 k
press: 1.00000 atm
elementType: 16 16 8 8 8 8 7 7 6 6 6 6 6 6 6 6 6 6 6 6 6 6 6 6 6 6 6 6 6 6 6 1 1 1 1 1 1 1 1 1 1 1 1 1 1 1 1 1 1
symmnumber: 1
zpe: 925239.3 jmol-1
zpe.correction: 0.352405 hartree
zpe.thermalcorrener: 0.380347 hartree
zpe.thermalcorrenthalpy: 0.381292 hartree
zpe.thermalcorrgfe: 0.290769 hartree
zpe.sumelectzpe: -2091.236184 hartree
zpe.sumelectthermal: -2091.208241 hartree
zpe.sumelectthermalent: -2091.207297 hartree
zpe.sumelectthermalfe: -2091.297819 hartree
dipole: -0.0245 8.9639 -0.6298
dipole: 8.9860
quadrupole: -132.6915 -199.5228 -195.8870
quadrupole: -4.1847 -3.7662 1.7506
quadrupole: 43.3422 -23.4890 -19.8533 -4.1847 -3.7662 1.7506
hfenergy: -2091.5885886 hartree
pointgroup: C01 [X(C23H18N2O4S2)]
dipole: -0.037981 -3.5011598 0.4891954 debye
polarizability: 608.4440764|-6.6959623|306.5343677|-2.1677037|-1.3188133|235.1749513 unknown
InChI: InChI=1S/C23H18N2O4S2/c1-17-16-22(24-30(26,27)18-10-4-2-5-11-18)20-14-8-9-15-21(20)23(17)25-31(28,29)19-12-6-3-7-13-19/h2-16H,1H3
charge 0 multiplicity 1
49 atoms
S  -3.959679 1.663693 -0.08795
S  3.967821 1.353001 -0.30204
O  -3.907075 2.38702 -1.55202
O  -3.952434 2.550127 1.284684
O  3.765835 2.38548 0.949479
O  3.828019 1.891503 -1.834887
N  -2.714769 0.179072 0.019496
N  2.855154 -0.211771 -0.099003
C  -0.727871 -1.087269 0.097526
C  0.690242 -1.216056 0.066691
C  -1.388547 0.26538 0.011395
C  -0.505252 1.466783 -0.0667
C  1.539622 0.001216 -0.047521
C  0.861777 1.298991 -0.090426
C  -1.522568 -2.260267 0.206082
C  1.287881 -2.501556 0.142087
C  -1.075797 2.861545 -0.11643
C  -0.922771 -3.530047 0.283264
C  0.489241 -3.653316 0.250853
C  -5.499784 0.578637 -0.049638
C  5.634852 0.502386 -0.10481
C  -6.082099 0.311057 1.198722
C  -6.016992 0.12908 -1.274286
C  6.242993 -0.025815 -1.25414
C  6.20719 0.472681 1.176067
C  -7.260344 -0.471421 1.213926
C  -7.195234 -0.652545 -1.236565
C  7.509689 -0.635501 -1.09872
C  7.474598 -0.140996 1.309393
C  -7.809141 -0.954046 0.002259
C  8.11783 -0.69593 0.17776
H  1.488993 2.194806 -0.131541
H  -2.609573 -2.149157 0.227245
H  2.379192 -2.566684 0.113707
H  -0.264239 3.605491 -0.142699
H  -1.714316 3.075163 0.761564
H  -1.710363 3.010685 -1.010821
H  -1.550219 -4.423504 0.368104
H  0.957469 -4.641369 0.310353
H  -5.644868 0.718792 2.115551
H  -5.531875 0.399957 -2.217237
H  5.755616 0.056611 -2.230795
H  5.691727 0.930605 2.026356
H  -7.746727 -0.697909 2.168274
H  -7.631235 -1.018908 -2.171615
H  8.018124 -1.057169 -1.971836
H  7.955876 -0.181145 2.291926
H  -8.723039 -1.557592 0.022622
H  9.099971 -1.168091 0.288997
