program: Gaussian 09
title: 000291556
version: EM64L-G09RevD.01
frameworkgroup: C1[X(C22H21NO4S2)]
method: RPBEPBE
basis: SDD
operation: Freq
keyword: #p
keyword: freq=noraman
keyword: PBEPBE/SDD
title: #p freq=noraman PBEPBE/SDD
converged: YES YES NO NO
title: Mulliken charges:
elementType: S S O O O O N C C C C C C C C C C C C C C C C C C C C C C H H H H H H H H H H H H H H H H H H H H H
charge: 0.837047 0.299360 -0.530285 -0.534448 -0.418112 -0.236174 -0.317890 0.194887 0.461399 -0.360391 -0.469905 0.000623 -0.580938 0.463558 -0.328779 -0.809218 -0.238472 -0.266128 -0.815121 0.223172 -0.218047 -0.207135 -0.229706 -0.217240 -0.248234 -0.215035 -0.213143 -0.219798 -0.229515 0.303856 0.260887 0.238424 0.264749 0.263937 0.224736 0.236897 0.321935 0.294303 0.239279 0.231368 0.228719 0.240222 0.237653 0.233427 0.259665 0.265098 0.381799 0.232287 0.232712 0.231714
chargesum: 0.00000
title: Mulliken charges with hydrogens summed into heavy atoms:
elementType: S S O O O O N C C C C C C C C C C C C C C C C C C C C C C
charge: 0.837047 0.299360 -0.530285 -0.534448 -0.036313 -0.236174 -0.317890 0.194887 0.461399 -0.360391 0.094837 0.000623 -0.342514 0.463558 -0.064030 -0.083648 0.083463 0.028175 -0.115753 0.223172 0.022175 0.030519 -0.229706 0.016187 0.011431 0.050062 0.019144 0.012914 0.002199
polarizability: 3.63799950e+02 -1.37307649e+00 3.56168471e+02 4.05121765e+00 6.29760277e+00 2.57838496e+02
1716.lowfreq: -46.4324 -6.7157 -6.0628 -2.1806 -0.0016 0.0011 0.0014 11.7939 14.2487
frequency: -46.3568 11.3323 14.1083 22.2282 28.2409 31.5214 37.5740 46.3906 54.2273 62.5934 70.3963 79.2788 91.5832 128.6439 147.1959 152.0483 158.7953 178.9843 192.2743 197.1091 207.6585 217.1741 228.7455 242.4850 266.8080 270.7695 285.7208 319.9355 334.5852 367.2180 378.2596 391.8090 401.4856 402.4968 411.9736 437.9491 453.7588 469.6930 493.2129 498.8742 514.0805 521.7995 528.8105 580.3810 594.5220 601.4682 607.8789 610.5781 651.9018 655.7058 677.1238 686.0256 697.8193 754.5631 758.5804 759.9864 765.2696 787.8990 815.4079 850.9593 852.4463 865.3618 869.4742 894.4217 902.0758 927.6926 939.1887 951.5868 968.1289 973.9451 978.7853 985.2774 987.6203 990.0518 998.6795 1002.8756 1003.3885 1007.2569 1014.9388 1021.7303 1039.2092 1045.4937 1046.7436 1058.8978 1070.6261 1075.0581 1081.9185 1139.6972 1171.7960 1171.9801 1182.2566 1187.5483 1221.3971 1222.3773 1253.7084 1276.7728 1301.0119 1303.8074 1315.9599 1355.6408 1369.2301 1372.7246 1382.5252 1396.1253 1398.6383 1402.9963 1409.1663 1415.7046 1425.2860 1436.5853 1457.0685 1458.9575 1466.4903 1470.8639 1471.7832 1484.4938 1545.5214 1575.1741 1586.0745 1587.4497 1600.4752 1601.6779 1672.2227 2821.9457 2975.4296 2977.7500 3057.4869 3064.8764 3083.0518 3089.5531 3097.7993 3122.8717 3128.3102 3134.2458 3138.0538 3144.0373 3148.5236 3150.4048 3152.2741 3158.9457 3163.0306 3169.7375 3172.1576 3513.4787
redmass: 1.0104 6.2915 5.7909 4.6327 5.1120 4.2682 7.1515 5.6027 5.5254 7.6491 7.1747 6.9144 5.9657 6.7315 1.3332 2.8096 4.7718 4.8258 6.4322 5.3895 3.2513 6.8331 4.2581 7.7728 3.7235 5.2892 3.2994 6.5725 5.0538 6.1742 9.3587 5.3774 2.8931 2.8692 9.1613 5.3043 4.4818 3.1147 4.2111 4.0583 3.5164 3.9259 4.3989 3.2303 3.6368 6.3285 3.4752 6.4576 1.8253 5.1447 6.7149 2.5219 2.1360 2.1212 1.4507 3.8566 3.3334 12.0334 7.2291 1.2460 1.2502 1.3510 4.8498 1.3404 17.1416 1.3769 1.3756 2.9436 3.2319 5.0327 1.3899 4.9246 1.4588 1.5273 1.3169 2.8619 1.8594 4.3476 3.3323 1.4728 1.5794 1.6110 2.0097 2.3972 1.6103 2.3754 1.6029 2.0454 1.0624 1.0545 1.1147 1.1248 2.0492 1.6367 2.1663 3.1031 1.3174 1.3214 1.2780 5.8702 1.5709 9.5539 8.5400 1.2247 1.2251 1.1662 2.2121 3.1172 2.1037 2.2474 1.9519 2.0853 1.1777 1.1379 1.0614 1.0683 5.3044 5.6891 6.2957 6.0051 6.6508 6.0765 8.8252 1.0692 1.0394 1.0418 1.0938 1.0919 1.0870 1.1001 1.0991 1.0914 1.0849 1.0858 1.0884 1.0902 1.0913 1.0928 1.0936 1.0968 1.0962 1.1015 1.1013 1.0640
irintensity: 0.2754 0.5144 0.0254 0.1526 0.2719 0.1096 1.1723 0.5217 0.0116 1.4924 1.9781 2.3128 6.9238 1.0107 1.2856 3.1249 1.6691 0.8422 1.9244 12.4192 3.8388 3.6335 7.1108 16.7325 2.4830 0.0642 3.1519 2.5713 10.8980 13.2355 10.0463 9.6206 0.2716 0.4518 5.2902 48.6068 25.2966 13.0278 72.6485 15.8923 30.5770 8.8267 3.0594 29.8859 8.7422 1.8594 23.5466 0.3652 118.3911 8.3669 2.5968 31.4893 37.0005 31.8789 64.2749 9.7772 70.9838 51.9811 31.3604 0.4573 0.4191 13.7770 5.8189 0.3238 47.8022 2.0048 2.8669 14.8378 28.1073 5.7326 0.0964 8.9077 0.9274 4.7126 0.1071 53.7713 23.0935 6.0524 14.7997 2.2110 2.9738 24.8229 9.8137 307.0970 8.4152 0.5064 11.5908 2.8536 2.1496 0.0794 3.1680 11.2671 16.6514 7.3478 24.6361 48.4160 1.7262 9.3319 3.4166 24.4917 34.6246 1.1289 6.0488 16.1384 1.4850 57.0169 6.3830 21.1283 12.2002 17.0527 20.0458 31.5725 49.8474 8.1101 11.9089 14.5197 72.9614 9.6330 2.3983 6.5177 31.3167 81.6698 174.2504 40.4342 28.3558 23.8293 16.8473 10.3899 5.7387 15.5053 12.5394 23.7023 0.1855 4.5288 5.4031 40.3704 8.3134 14.6971 1.2082 19.4215 2.8120 21.2122 46.9894 31.9661
temp: 298.150 k
press: 1.00000 atm
elementType: 16 16 8 8 8 8 7 6 6 6 6 6 6 6 6 6 6 6 6 6 6 6 6 6 6 6 6 6 6 1 1 1 1 1 1 1 1 1 1 1 1 1 1 1 1 1 1 1 1 1
symmnumber: 1
zpe: 982815.5 jmol-1
zpe.correction: 0.374335 hartree
zpe.thermalcorrener: 0.403057 hartree
zpe.thermalcorrenthalpy: 0.404001 hartree
zpe.thermalcorrgfe: 0.310052 hartree
zpe.sumelectzpe: -2000.463781 hartree
zpe.sumelectthermal: -2000.435059 hartree
zpe.sumelectthermalent: -2000.434115 hartree
zpe.sumelectthermalfe: -2000.528064 hartree
dipole: -5.1427 -0.2122 1.8521
dipole: 5.4702
quadrupole: -176.7629 -158.1435 -176.9612
quadrupole: -2.3654 13.2494 -3.8741
quadrupole: -6.1404 12.4790 -6.3387 -2.3654 13.2494 -3.8741
hfenergy: -2000.838116 hartree
pointgroup: C01 [X(C22H21N1O4S2)]
dipole: 2.1504063 0.0170473 -0.0849301 debye
polarizability: 347.3117644|-29.6236785|310.5880042|-25.0153142|-41.0205934|319.907149 unknown
InChI: InChI=1S/C16H16NO2S.C6H5O2S/c1-11-8-12(2)16(17-10-15(18)19)14(9-11)20-13-6-4-3-5-7-13;7-9(8)6-4-2-1-3-5-6/h3-9,18H,10H2,1-2H3;1-5H
charge 0 multiplicity 1
50 atoms
S  -2.663549 -0.242368 -0.140046
S  1.289594 0.065311 0.640896
O  -2.587494 -0.998694 -1.589562
O  -4.066181 0.499849 0.306959
O  -1.872873 4.320329 1.881072
O  -1.677412 2.174657 2.743563
N  -1.210441 1.324144 -0.021501
C  -0.410607 1.297721 -1.194973
C  -0.804613 1.78119 -2.492472
C  0.887975 0.705306 -1.03821
C  -2.002499 2.525064 0.298962
C  -2.177616 -1.507349 1.173789
C  0.130324 1.72208 -3.547633
C  1.432086 1.187305 -3.376842
C  1.796898 0.667257 -2.111653
C  -2.20227 2.3046 -2.774284
C  -2.002387 -1.078714 2.499217
C  -2.024361 -2.834267 0.739454
C  2.422872 1.177221 -4.525151
C  -1.810993 2.926077 1.7568
C  -1.660844 -2.066517 3.452609
C  -1.686954 -3.802084 1.71347
C  2.883473 -0.818164 0.313794
C  -1.508299 -3.41868 3.063686
C  4.100564 -0.236899 0.737495
C  2.86939 -2.108204 -0.267523
C  5.312275 -0.950489 0.574858
C  4.083349 -2.81282 -0.436452
C  5.305263 -2.23615 -0.014008
H  -3.09918 2.313191 0.19314
H  -1.757352 3.38183 -0.347374
H  -0.170064 2.083715 -4.538623
H  2.792915 0.236009 -1.97144
H  -2.976426 1.750686 -2.217279
H  -2.304903 3.377719 -2.52072
H  -2.434042 2.199243 -3.847226
H  -2.086866 -0.022373 2.774851
H  -2.164301 -3.090278 -0.315561
H  3.018947 2.110903 -4.538203
H  3.133245 0.336597 -4.441455
H  1.911077 1.102429 -5.500465
H  -1.506896 -1.771912 4.495869
H  -1.566344 -4.849006 1.415482
H  -1.244014 -4.173557 3.812368
H  4.096619 0.760688 1.188572
H  1.917677 -2.550815 -0.579735
H  -1.822931 4.570099 2.843949
H  6.254922 -0.501405 0.906556
H  4.072877 -3.811249 -0.887421
H  6.243964 -2.78742 -0.138897
