program: Gaussian 09
title: 000291454
version: EM64L-G09RevD.01
frameworkgroup: C1[X(C22H16Cl2O)]
method: RPBEPBE
basis: SDD
operation: Freq
keyword: #p
keyword: freq=noraman
keyword: PBEPBE/SDD
title: #p freq=noraman PBEPBE/SDD
converged: NO YES NO NO
title: Mulliken charges:
elementType: Cl Cl O C C C C C C C C C C C C C C C C C C C C C C H H H H H H H H H H H H H H H H
charge: -0.056837 -0.056837 -0.293210 0.189052 0.189051 0.097527 0.097525 0.381042 0.381039 -0.613137 -0.613140 0.368040 0.368038 -0.826060 -0.826058 -0.353922 -0.353922 -0.364972 -0.364972 -0.235711 -0.235708 -0.216180 -0.216180 -0.124049 -0.124050 0.226070 0.226070 0.234089 0.228401 0.228306 0.228342 0.234089 0.228365 0.218463 0.218464 0.258182 0.258181 0.253582 0.253581 0.254724 0.254724
chargesum: 0.00000
title: Mulliken charges with hydrogens summed into heavy atoms:
elementType: Cl Cl O C C C C C C C C C C C C C C C C C C C C C C
charge: -0.056837 -0.056837 -0.293210 0.189052 0.189051 0.097527 0.097525 0.381042 0.381039 -0.387067 -0.387070 0.368040 0.368038 -0.135264 -0.135263 -0.135460 -0.135458 -0.106790 -0.106790 0.017872 0.017873 0.038543 0.038543 -0.124049 -0.124050
polarizability: 5.39820997e+02 -1.86224698e-04 3.84741335e+02 2.94326572e-02 -1.51782374e-01 1.04775276e+02
1716.lowfreq: -21.1150 -11.6838 -6.2942 0.0004 0.0011 0.0017 4.2761 5.7584 33.2816
frequency: -21.1134 -11.1846 33.2666 45.5264 49.7795 83.4310 87.9791 114.6386 128.3490 163.6150 178.8512 192.7513 196.4915 208.6572 230.3080 267.4768 278.3616 301.4329 304.1096 310.0884 342.4696 347.9279 393.2569 403.9563 404.4228 420.8574 434.8549 444.1387 487.2975 499.6606 524.8053 529.3612 530.2997 618.0791 626.6389 640.0980 647.7355 656.2555 703.7448 706.0910 708.0416 714.4869 719.8663 759.5014 806.5128 809.9307 810.1922 832.4032 836.6283 843.9736 860.3557 874.3952 946.1757 946.4835 956.6711 966.6015 969.9971 991.9688 993.5929 1004.4593 1013.3206 1035.2508 1053.9336 1069.2857 1070.0171 1078.8647 1082.1147 1111.0728 1131.0654 1140.0431 1176.4740 1187.8074 1192.7966 1207.5578 1276.5089 1276.8299 1299.9029 1306.5995 1354.6056 1355.2150 1370.2723 1385.9496 1397.3955 1406.2748 1408.1992 1410.5284 1441.3443 1456.0353 1460.1747 1469.1535 1476.4547 1481.0687 1496.3128 1501.6028 1549.0950 1550.2620 1566.1359 1570.2809 1599.3168 1601.3727 1644.7247 2971.8665 2972.8705 3045.0443 3045.1002 3083.9225 3086.8764 3155.2600 3157.3033 3158.7942 3158.9661 3162.2262 3162.9421 3179.1536 3179.3686 3190.7360 3190.9402
redmass: 3.5323 3.5850 9.3853 11.9717 4.6477 5.1455 5.6866 5.3237 1.0906 3.6105 7.3444 11.3000 3.7586 1.2042 7.9782 6.7644 4.6600 2.5931 4.7996 6.9394 4.4995 3.8946 5.4053 2.8907 2.8567 4.6842 2.8364 8.8661 3.0543 4.4181 3.3671 7.5602 5.6208 6.3722 7.1754 6.1853 6.7342 3.8121 7.1968 7.1989 3.1706 3.2086 6.2260 3.2110 4.1872 1.3859 1.4048 1.5129 1.4760 6.7860 1.4812 1.5603 1.3720 1.3764 4.6195 1.3595 1.3548 4.2679 3.7675 1.5754 1.6029 1.4503 1.6579 3.6132 5.7630 2.5177 2.6062 1.6631 1.5368 3.6627 2.2495 1.2645 1.4573 1.8835 4.2338 1.2904 1.3042 1.2924 4.6887 4.5167 4.3814 3.6914 1.2395 4.1190 1.5293 2.3445 3.2416 1.2819 1.0468 1.5521 1.0448 2.0606 3.7232 2.2735 6.8534 6.7706 7.4916 7.6129 6.1191 6.2235 7.3750 1.0383 1.0375 1.0967 1.0968 1.0986 1.0980 1.0905 1.0903 1.0884 1.0884 1.0902 1.0907 1.0964 1.0963 1.0934 1.0934
irintensity: 0.0001 0.0415 0.0114 0.1774 0.0000 0.0003 0.2879 1.9709 0.0000 0.1630 1.5988 0.4133 0.0005 0.4535 0.1587 2.2593 0.0000 0.5535 0.0781 1.3908 0.1647 6.0503 13.2983 0.0002 0.0040 0.0001 4.8175 13.0920 36.8888 18.7688 0.0002 9.3626 42.1120 0.0877 1.3248 0.5605 17.5505 0.0000 1.1099 14.1901 0.0021 11.0058 4.9420 0.0001 18.9843 0.0011 19.0487 0.0001 71.1719 15.8460 64.9614 0.0001 0.0002 0.0004 45.0715 0.0001 0.4958 35.9932 3.0324 19.2006 2.6489 16.1659 0.0002 20.2540 47.5828 7.5750 47.0388 8.7564 7.4774 63.1118 29.1033 0.0029 6.1196 0.2005 0.0032 1.3342 0.4783 0.0958 2.5897 0.0007 0.4201 3.1564 14.0936 0.5919 4.3923 17.2177 51.7459 135.8314 0.0142 22.5796 32.1241 148.4762 1.4665 22.1855 53.2460 26.9528 0.4294 0.0283 0.0544 3.8134 7.3861 6.1800 84.4818 0.0770 37.8195 32.6552 2.5390 23.9950 0.2777 5.9764 1.9478 1.0868 2.3735 0.2750 11.3172 5.2060 12.7638
temp: 298.150 k
press: 1.00000 atm
elementType: 17 17 8 6 6 6 6 6 6 6 6 6 6 6 6 6 6 6 6 6 6 6 6 6 6 1 1 1 1 1 1 1 1 1 1 1 1 1 1 1 1
symmnumber: 1
zpe: 810182.2 jmol-1
zpe.correction: 0.308582 hartree
zpe.thermalcorrener: 0.328753 hartree
zpe.thermalcorrenthalpy: 0.329697 hartree
zpe.thermalcorrgfe: 0.259301 hartree
zpe.sumelectzpe: -1841.579672 hartree
zpe.sumelectthermal: -1841.559502 hartree
zpe.sumelectthermalent: -1841.558558 hartree
zpe.sumelectthermalfe: -1841.628953 hartree
dipole: 0.0000 4.6343 0.0035
dipole: 4.6343
quadrupole: -175.9738 -137.1744 -166.9709
quadrupole: 0.0000 0.0121 -0.0333
quadrupole: -15.9341 22.8654 -6.9312 0.0000 0.0121 -0.0333
hfenergy: -1841.8882543 hartree
pointgroup: C01 [X(C22H16Cl2O1)]
dipole: -0.0005256 -1.822533 0.0517958 debye
polarizability: 539.8209837|-0.0444556|384.4945354|-0.0357849|-8.3102991|105.0220895 unknown
InChI: InChI=1S/C22H16Cl2O/c1-13-11-19-20(12-14(13)2)22(16-5-9-18(24)10-6-16)25-21(19)15-3-7-17(23)8-4-15/h3-12H,1-2H3
charge 0 multiplicity 1
41 atoms
Cl 6.444574 3.15296 -0.12879
Cl -6.442972 3.156594 -0.129069
O  0.000165 0.896607 -0.059982
C  0.731118 -1.259795 0.003009
C  -0.73201 -1.259377 0.003052
C  1.155663 0.090263 -0.036388
C  -1.15579 0.090922 -0.036259
C  0.72802 -3.715554 0.071811
C  -0.730322 -3.715142 0.071593
C  1.429517 -2.508747 0.038253
C  -1.431127 -2.507933 0.038047
C  2.423752 0.801801 -0.057502
C  -2.423478 0.803172 -0.05739
C  1.480461 -5.032507 0.107808
C  -1.483524 -5.031677 0.107012
C  3.676929 0.11898 -0.035431
C  -3.677038 0.121154 -0.032403
C  2.443591 2.230421 -0.102013
C  -2.442514 2.231708 -0.104836
C  4.894736 0.826075 -0.056755
C  -4.894443 0.828937 -0.053845
C  3.654602 2.945404 -0.123746
C  -3.653119 2.947373 -0.126681
C  4.870721 2.233427 -0.100889
C  -4.869638 2.236177 -0.100994
H  2.522136 -2.53992 0.038929
H  -2.523763 -2.538491 0.038311
H  2.571191 -4.869562 0.101701
H  1.231986 -5.619917 1.012581
H  1.229337 -5.669531 -0.761932
H  -1.234292 -5.620337 1.010747
H  -2.57416 -4.868058 0.102404
H  -1.23386 -5.667792 -0.763829
H  3.715934 -0.971496 -0.001249
H  -3.716656 -0.969212 0.004507
H  1.496967 2.776908 -0.119562
H  -1.495583 2.777583 -0.124705
H  5.847618 0.2892 -0.039212
H  -5.847627 0.292676 -0.033972
H  3.65457 4.038656 -0.157889
H  -3.652473 4.04055 -0.163137
