program: Gaussian 09
title: 000291469
version: EM64L-G09RevD.01
frameworkgroup: C1[X(C22H23N3O5S2)]
method: RPBEPBE
basis: SDD
operation: Freq
keyword: #p
keyword: freq=noraman
keyword: PBEPBE/SDD
title: #p freq=noraman PBEPBE/SDD
converged: YES YES NO NO
title: Mulliken charges:
elementType: S S O O O O O N N N C C C C C C C C C C C C C C C C C C C C C C H H H H H H H H H H H H H H H H H H H H H H H
charge: 0.784158 0.939898 -0.233883 -0.694175 -0.656959 -0.500177 -0.487061 -0.107867 -0.255730 -0.494164 -0.384346 -0.413383 0.415885 -0.321071 -0.323252 -0.127769 -0.423097 0.339147 -0.235558 -0.277986 -0.153838 -0.122669 -0.226620 -0.228342 -0.269589 -0.205530 -0.215074 -0.212290 -0.226684 -0.204299 -0.230516 -0.226955 0.263815 0.236865 0.238865 0.260505 0.260385 0.220436 0.217992 0.285688 0.236279 0.267796 0.303175 0.274120 0.284219 0.289584 0.247715 0.297729 0.342362 0.233456 0.230357 0.230624 0.245466 0.272355 0.240010
chargesum: 0.00000
title: Mulliken charges with hydrogens summed into heavy atoms:
elementType: S S O O O O O N N N C C C C C C C C C C C C C C C C C C C C C C
charge: 0.784158 0.939898 -0.233883 -0.694175 -0.656959 -0.500177 -0.487061 -0.107867 0.047446 -0.209945 0.116334 0.085987 0.415885 0.159750 0.180427 -0.127769 -0.186819 0.339147 0.032238 -0.003866 -0.153838 -0.122669 0.062964 0.019373 0.028140 0.136832 0.018382 0.018068 0.003940 0.041167 0.041838 0.013055
polarizability: 6.48958011e+02 -6.31262462e+00 4.11849134e+02 -1.13368630e+01 2.94980438e+01 2.46243002e+02
1716.lowfreq: -7.7303 -6.9857 -2.4611 -0.0020 0.0003 0.0010 6.6112 11.6106 18.8242
frequency: -1.2846 11.5524 18.7316 25.5219 33.8606 45.0334 58.8278 66.0238 76.8149 78.1564 83.1017 89.7166 98.4559 116.8979 121.3164 135.8634 139.7835 142.8391 156.2501 177.1137 190.5970 195.5068 215.4222 239.1334 248.8253 256.4453 271.3187 298.3678 321.5080 327.6872 332.8738 348.5824 351.9189 366.7863 388.8957 393.8490 400.7669 407.4565 413.3738 419.4526 456.2806 468.5190 485.5279 492.1234 502.0734 512.6121 545.8058 596.9042 605.3587 613.6741 622.4119 647.5833 647.8507 679.2224 681.3713 684.1160 688.7392 695.8105 719.6093 753.1366 764.6913 793.2138 798.2759 810.3832 814.7189 824.4363 827.2961 845.4069 847.3949 861.7292 869.5387 910.2435 922.0500 948.1421 953.6120 959.2781 968.5096 975.6053 979.2134 980.8130 993.6881 996.5452 998.9871 1000.5257 1009.0503 1010.7221 1013.3759 1028.1748 1033.4390 1039.4073 1045.5637 1065.4507 1068.4707 1080.9731 1090.3354 1109.9005 1143.5135 1165.3655 1167.9318 1172.2472 1173.8564 1181.4131 1198.2817 1204.9073 1222.4528 1256.5122 1272.2884 1284.7389 1292.8760 1294.2514 1299.9455 1331.1217 1336.8334 1351.2722 1360.5507 1374.1949 1377.3372 1381.5351 1382.2100 1414.5021 1427.6895 1429.3698 1430.4033 1438.5498 1439.7902 1449.8593 1450.6447 1454.5737 1494.1546 1509.5481 1543.1815 1561.3918 1580.4645 1592.5659 1596.1155 1616.4235 2917.6711 2971.4324 2982.1575 2995.8962 3009.7833 3085.4846 3098.9190 3101.7889 3105.5024 3114.5665 3126.1674 3134.7280 3139.0017 3144.3749 3153.2700 3153.4786 3154.5437 3165.4828 3166.6537 3169.2090 3176.0170 3192.6546 3350.8314
redmass: 5.2118 6.3232 6.3099 7.3215 4.9337 5.8616 5.7702 5.5306 6.3104 4.2439 5.0865 7.9491 5.6091 8.1756 7.3133 6.6042 7.1210 4.9191 9.1703 4.2892 5.0477 6.3210 5.6555 7.7235 3.8484 5.1020 4.8578 4.7643 7.8218 4.8150 4.7616 4.2469 6.8947 6.4488 5.0162 7.4089 2.8328 3.0235 8.9739 2.2051 3.5304 3.3882 4.4270 4.2391 4.1983 5.5116 3.1019 6.4403 6.4642 2.9447 3.6468 7.0717 7.0006 8.9504 5.4707 8.6937 2.9660 2.2493 2.4401 1.5091 1.2840 4.4607 4.1937 2.7594 3.2532 2.1617 1.8456 2.9302 1.2553 1.2912 1.3396 2.6592 1.3586 1.3245 7.1468 3.4138 6.0305 1.5094 1.3745 4.5167 1.4208 2.4722 1.3519 3.8493 3.9475 1.7821 1.5085 2.0747 1.7018 1.8678 1.9543 2.9127 1.5497 1.5719 2.0725 2.0646 3.6032 1.0693 1.0692 1.1038 1.1017 1.2433 1.2781 1.1392 1.6655 1.1775 1.6243 1.2463 1.3225 1.3118 1.4586 1.2724 1.2477 1.3181 1.7986 1.8944 7.8373 1.6098 7.8958 1.1054 2.1571 2.8133 2.2679 1.9746 1.1126 2.0228 1.1298 1.1136 5.4359 4.0375 5.1063 5.9800 5.9426 6.6816 6.7668 6.4833 1.0829 1.0686 1.0644 1.0625 1.0600 1.0953 1.1018 1.1025 1.1025 1.0940 1.0847 1.0875 1.0866 1.0919 1.0945 1.0924 1.0905 1.1015 1.0959 1.0879 1.0998 1.1000 1.0750
irintensity: 0.0418 0.4595 0.1417 1.6771 0.2329 0.6620 0.0472 1.4863 4.6385 0.6337 3.8226 3.6766 4.2023 20.8285 1.8094 2.0267 3.2506 21.2749 4.7626 2.7605 4.6140 2.5393 44.3205 6.2704 0.4277 11.1335 4.8957 15.0590 6.9087 5.5983 9.3249 1.7409 7.9485 15.9338 33.8506 43.1713 0.2734 1.6410 64.9372 0.8078 1.9791 0.5337 22.5721 60.6493 26.2425 23.8138 24.2211 0.4712 0.7909 23.1737 22.1072 0.4804 0.9854 32.4202 8.9972 44.0102 14.1960 44.8454 5.5105 75.1666 65.4394 8.2786 5.9248 45.0856 144.4942 34.5499 3.0340 34.6253 1.0924 63.3677 101.2631 1.9501 8.6548 1.6504 69.3201 24.8497 12.2870 0.6104 3.1060 13.1245 0.5029 25.8894 2.0219 1.4646 7.4997 55.8209 2.4533 11.8331 5.8195 55.9468 9.7972 29.5605 14.9393 7.8753 17.1871 2.9267 8.8751 0.6793 5.3519 15.6505 12.8282 18.7046 29.4500 10.3841 27.3537 5.9057 25.4452 11.3234 8.7361 15.3489 31.4898 14.0273 13.6734 2.7719 2.9282 15.5455 4.1994 7.2556 1.3381 7.7516 12.0422 25.6529 33.9386 4.9780 6.5413 20.2390 16.3146 15.8768 7.6668 86.8716 10.0272 10.4826 26.4153 0.2836 0.7501 37.6315 43.8791 43.5036 60.7711 19.1970 6.6331 27.5462 20.9196 41.2571 14.0095 4.5199 0.0591 7.1117 3.9673 0.6820 9.1866 15.5025 3.8630 67.2808 7.3260 0.1958 20.0595 1.9804 2.9413
temp: 298.150 k
press: 1.00000 atm
elementType: 16 16 8 8 8 8 8 7 7 7 6 6 6 6 6 6 6 6 6 6 6 6 6 6 6 6 6 6 6 6 6 6 1 1 1 1 1 1 1 1 1 1 1 1 1 1 1 1 1 1 1 1 1 1 1
symmnumber: 1
zpe: 1080628.6 jmol-1
zpe.correction: 0.411590 hartree
zpe.thermalcorrener: 0.442363 hartree
zpe.thermalcorrenthalpy: 0.443307 hartree
zpe.thermalcorrgfe: 0.347234 hartree
zpe.sumelectzpe: -2185.954278 hartree
zpe.sumelectthermal: -2185.923505 hartree
zpe.sumelectthermalent: -2185.922560 hartree
zpe.sumelectthermalfe: -2186.018634 hartree
dipole: -1.8377 1.9055 6.3589
dipole: 6.8879
quadrupole: -221.9235 -171.1649 -208.3925
quadrupole: 5.6779 12.8213 2.8218
quadrupole: -21.4298 29.3287 -7.8988 5.6779 12.8213 2.8218
hfenergy: -2186.3658679 hartree
pointgroup: C01 [X(C22H23N3O5S2)]
dipole: 0.0544849 -1.3735674 2.3353689 debye
polarizability: 611.8815648|69.2777652|303.453713|-89.1533766|63.4808292|391.7148686 unknown
InChI: InChI=1S/C10H13N3O.2C6H5O2S/c11-8-1-2-9(12)10(7-8)13-3-5-14-6-4-13;2*7-9(8)6-4-2-1-3-5-6/h1-2,7,11-12H,3-6H2;2*1-5H
charge 0 multiplicity 1
55 atoms
S  -1.824433 0.876742 -0.477883
S  4.187603 0.826427 -1.890376
O  -3.157887 -3.743362 0.429976
O  -2.88928 -0.353794 -1.008755
O  -0.420672 0.19659 0.230843
O  5.792487 0.879423 -2.112424
O  3.170702 1.633559 -2.864451
N  -0.977515 -2.739501 -1.197313
N  -1.663107 -0.914778 -3.506911
N  3.582335 -1.191272 -1.997365
C  -0.775345 -3.019696 0.248332
C  -2.125935 -3.490561 -1.786298
C  -0.063359 -2.040085 -1.931846
C  -2.118737 -2.883808 1.009187
C  -3.41396 -3.316725 -0.95632
C  -0.465258 -1.405295 -3.245409
C  1.269797 -1.826538 -1.490909
C  2.249734 -1.319305 -2.373651
C  0.617478 -1.091913 -4.192342
C  1.914977 -0.991256 -3.760486
C  -2.758815 1.459457 1.083777
C  3.828295 1.168707 -0.053661
C  -4.116528 1.120468 1.213499
C  -2.074511 2.221334 2.050185
C  4.945693 1.44073 0.756497
C  2.500979 1.117089 0.405052
C  -4.81539 1.557043 2.364066
C  -2.784831 2.657685 3.193324
C  -4.152415 2.326502 3.348803
C  4.705778 1.685916 2.127902
C  2.29403 1.353924 1.78662
C  3.38607 1.639529 2.639286
H  -0.089639 -2.267011 0.665148
H  -0.371413 -4.044548 0.372073
H  -1.842134 -4.563228 -1.758368
H  -2.284187 -3.191875 -2.83214
H  -2.435289 -1.824732 0.977941
H  -1.98741 -3.225542 2.048446
H  -4.201803 -3.985583 -1.337573
H  -3.732775 -2.25726 -0.974382
H  1.571685 -2.104537 -0.476992
H  0.310165 -0.792267 -5.198097
H  -2.308928 -0.89183 -2.658217
H  2.719916 -0.655417 -4.418722
H  3.771208 -1.507365 -1.02533
H  -4.590366 0.510504 0.436056
H  -1.013292 2.459842 1.921155
H  5.953249 1.464397 0.329027
H  1.623769 0.894852 -0.219876
H  -5.873033 1.298947 2.487586
H  -2.272981 3.252908 3.9578
H  -4.698813 2.666468 4.23572
H  5.548283 1.912226 2.789605
H  1.269694 1.292704 2.166302
H  3.211417 1.824112 3.704891
