program: Gaussian 09
title: 000291460
version: EM64L-G09RevD.01
frameworkgroup: C1[X(C16H15N5O6)]
method: RPBEPBE
basis: SDD
operation: Freq
keyword: #p
keyword: freq=noraman
keyword: PBEPBE/SDD
title: #p freq=noraman PBEPBE/SDD
converged: YES YES NO NO
title: Mulliken charges:
elementType: O O O O O O N N N N N C C C C C C C C C C C C C C C C H H H H H H H H H H H H H H H
charge: -0.180484 -0.270941 -0.198309 -0.199158 -0.204468 -0.202288 -0.044702 -0.427196 0.023975 0.025436 0.017495 -0.551999 0.109845 -0.361088 0.355879 -0.673854 -0.473620 -0.380083 0.316773 0.371634 0.251302 -0.209406 -0.287963 -0.370093 -0.494908 0.448027 -0.365839 0.236823 0.239098 0.221897 0.219405 0.231033 0.231549 0.209361 0.312948 0.240776 0.367288 0.242690 0.295938 0.292809 0.336873 0.297544
chargesum: 0.00000
title: Mulliken charges with hydrogens summed into heavy atoms:
elementType: O O O O O O N N N N N C C C C C C C C C C C C C C C C
charge: -0.180484 -0.270941 -0.198309 -0.199158 -0.204468 -0.202288 -0.044702 -0.059907 0.023975 0.025436 0.017495 -0.076078 0.109845 0.080214 0.355879 -0.001911 -0.160672 -0.139307 0.316773 0.371634 0.251302 0.033284 0.007975 -0.077285 -0.158034 0.448027 -0.068295
polarizability: 5.10529741e+02 2.60515706e+01 3.21438169e+02 3.76367998e+00 -9.50558730e+00 1.03377824e+02
1716.lowfreq: -3.9506 0.0008 0.0009 0.0010 2.0898 5.0755 12.1972 27.1791 31.8455
frequency: 12.0189 27.1608 31.8220 35.3647 41.5500 52.2990 58.5045 77.0233 89.0458 97.6792 105.7177 154.8638 157.4415 163.8621 172.2847 187.2578 200.3354 226.5442 245.5981 292.5266 297.0976 306.7738 338.5186 355.1017 367.4937 376.1895 406.5794 419.7088 426.1531 442.6148 475.6068 501.4301 513.0263 515.5927 540.6648 599.3960 613.0944 643.2004 650.7761 660.3003 664.1860 684.1692 687.1192 706.4398 711.2621 724.7543 743.6673 753.9926 755.8368 814.8684 828.2913 834.4843 851.8832 861.2912 879.3871 887.2142 911.7311 935.7862 962.4164 963.2053 987.6139 1000.3133 1009.5440 1010.6709 1047.0071 1050.6276 1075.5564 1082.2372 1087.4221 1098.6629 1105.3507 1117.6458 1137.5549 1166.1105 1183.5296 1210.5286 1213.5537 1220.0706 1231.9443 1266.9739 1279.8368 1286.2668 1300.6141 1311.7394 1331.3193 1343.5537 1363.5373 1378.0677 1386.5836 1391.9841 1396.9759 1434.0724 1445.2728 1472.8703 1476.2298 1479.9073 1481.2613 1485.6894 1505.7652 1521.3126 1533.5917 1581.8830 1586.4206 1614.5905 1621.3879 2977.4185 2980.0897 2991.4421 3032.2588 3060.7320 3079.4041 3084.4363 3149.3833 3168.4490 3180.9318 3188.3372 3190.2768 3196.5897 3202.1803 3208.7371
redmass: 8.1827 5.6212 5.9814 6.4965 4.4627 11.3378 13.5231 9.9856 3.2644 2.7124 6.5223 9.3408 6.1163 5.4682 5.6273 6.4620 5.9296 1.8942 1.6982 4.4271 6.9530 7.6377 4.0560 4.9445 9.9896 6.7605 6.0025 5.6192 3.6106 4.2787 6.6497 7.5101 7.2700 3.6991 4.8144 4.6774 6.4359 7.1005 7.7537 8.1602 5.6162 8.1155 2.0653 7.5738 7.6270 4.9908 1.2742 12.3599 4.1344 1.5542 4.6174 1.1971 2.6787 1.4201 1.8051 4.2439 2.3185 1.4282 1.4843 1.4112 5.7612 1.3669 1.3404 2.8846 2.6949 2.3169 1.5606 2.2187 1.9162 4.3139 3.3047 1.8565 1.3475 9.4997 1.1773 5.1904 3.0037 2.1965 1.7967 1.4307 1.2517 1.2436 2.0755 2.6931 1.4198 4.4383 6.7524 11.3380 6.3953 4.7241 1.2140 3.2742 5.9608 1.8275 1.1232 1.0887 2.6091 1.2547 1.8901 3.3625 2.3310 5.7057 4.4564 7.0236 7.3377 1.0656 1.0367 1.0616 1.0983 1.0964 1.1008 1.0998 1.0875 1.0941 1.0898 1.0920 1.0963 1.0919 1.0957 1.0792
irintensity: 2.1448 0.4819 0.5161 0.6743 0.1624 0.0017 0.1869 0.8043 1.2493 0.5875 0.4040 1.9669 0.4485 3.6703 2.0667 4.0849 1.6403 3.9239 1.9437 0.5143 0.3525 0.6493 0.9168 2.1886 0.9565 1.0706 0.2314 11.6636 4.1872 0.8058 2.5138 1.5644 2.8356 11.2269 4.6081 9.3904 4.5071 4.3254 15.1457 18.1240 7.1819 6.2930 39.2252 8.9465 4.8690 1.7109 14.5685 12.6705 15.5719 31.8584 0.8079 81.3188 16.6566 19.2202 6.1449 7.6408 15.9302 0.3894 25.7229 20.8470 0.3262 0.7354 0.2063 11.7263 4.2387 10.8715 32.5034 81.6098 15.6504 66.9592 31.4658 11.2517 81.3480 338.3812 32.1539 505.6362 167.5497 93.2220 139.5509 1.3079 5.4407 9.0301 31.6241 106.0943 7.3315 263.5536 56.5163 72.9361 44.4991 59.2086 12.0280 11.0006 1.2678 69.5805 9.5368 41.5479 17.2941 29.4512 152.3852 23.0382 8.5576 84.9255 107.0099 47.3214 405.1313 2.6222 31.4241 34.2043 2.0673 12.1450 59.8200 35.7485 10.5794 14.2801 4.0000 21.5325 4.4511 3.2328 0.2804 75.4705
temp: 298.150 k
press: 1.00000 atm
elementType: 8 8 8 8 8 8 7 7 7 7 7 6 6 6 6 6 6 6 6 6 6 6 6 6 6 6 6 1 1 1 1 1 1 1 1 1 1 1 1 1 1 1
symmnumber: 1
zpe: 795783.0 jmol-1
zpe.correction: 0.303098 hartree
zpe.thermalcorrener: 0.327508 hartree
zpe.thermalcorrenthalpy: 0.328452 hartree
zpe.thermalcorrgfe: 0.245019 hartree
zpe.sumelectzpe: -1341.602524 hartree
zpe.sumelectthermal: -1341.578113 hartree
zpe.sumelectthermalent: -1341.577169 hartree
zpe.sumelectthermalfe: -1341.660603 hartree
dipole: 6.9875 6.5937 0.2134
dipole: 9.6097
quadrupole: -191.8171 -181.0957 -155.2274
quadrupole: 19.6189 1.3670 2.5090
quadrupole: -15.7704 -5.0490 20.8193 19.6189 1.3670 2.5090
hfenergy: -1341.9056212 hartree
pointgroup: C01 [X(C16H15N5O6)]
dipole: 2.7963558 -2.541863 -0.1158209 debye
polarizability: 511.1610191|-22.6812406|320.3156501|-11.4601793|-11.1459475|103.8690644 unknown
InChI: InChI=1S/C16H15N5O6/c1-2-4-14(11-5-3-6-12(9-11)19(22)23)17-18-15-8-7-13(20(24)25)10-16(15)21(26)27/h3,5-10,18H,2,4H2,1H3
charge 0 multiplicity 1
42 atoms
O  -4.487123 -2.653991 0.476881
O  -2.234558 -2.987103 0.460849
O  5.615571 3.48834 -0.202412
O  3.355003 3.616243 0.064615
O  -5.118737 3.53524 -0.35786
O  -6.443621 1.693164 -0.081592
N  0.630722 -0.404071 0.082949
N  -0.623861 -0.971182 0.189404
N  4.450337 2.949503 -0.074655
N  -3.28892 -2.197432 0.387756
N  -5.289686 2.265701 -0.179564
C  1.571987 -2.716381 0.407055
C  1.680908 -1.214996 0.188455
C  1.327877 -3.514236 -0.912715
C  3.008039 -0.55932 0.042773
C  1.075352 -5.010169 -0.634286
C  3.109174 0.858919 0.052098
C  4.200766 -1.320188 -0.11777
C  -1.753976 -0.185271 0.100258
C  4.367898 1.461845 -0.091682
C  -3.07549 -0.763256 0.196704
C  5.455832 -0.688019 -0.262375
C  -1.657313 1.2304 -0.09457
C  5.558798 0.716491 -0.249054
C  -4.231198 0.043695 0.106581
C  -4.082828 1.421412 -0.082971
C  -2.797401 2.024692 -0.185634
H  0.748547 -2.942205 1.114951
H  2.484361 -3.097357 0.896689
H  2.202206 -3.389926 -1.580547
H  0.461396 -3.088298 -1.454271
H  0.939474 -5.56921 -1.577046
H  0.162271 -5.148969 -0.026404
H  1.922027 -5.467493 -0.088816
H  2.215881 1.474245 0.173921
H  4.157119 -2.413141 -0.142231
H  -0.808645 -1.987006 0.323579
H  6.357249 -1.295887 -0.387418
H  -0.658599 1.663315 -0.171081
H  6.514983 1.23483 -0.354335
H  -5.222938 -0.409227 0.183366
H  -2.728786 3.105394 -0.334791
