program: Gaussian 09
title: 000291519
version: EM64L-G09RevD.01
frameworkgroup: C1[X(C26H22N2O4S2)]
method: RPBEPBE
basis: SDD
operation: Freq
keyword: #p
keyword: freq=noraman
keyword: PBEPBE/SDD
title: #p freq=noraman PBEPBE/SDD
converged: YES YES NO NO
title: Mulliken charges:
elementType: S S O O O O N N C C C C C C C C C C C C C C C C C C C C C C C C C C H H H H H H H H H H H H H H H H H H H H H H
charge: 0.855621 0.844191 -0.527171 -0.531587 -0.520356 -0.538406 -0.299385 -0.258100 -0.268476 -0.238397 -0.485399 -0.466274 0.071444 -0.010380 0.222051 0.273296 -0.195013 -0.173087 -0.352364 -0.324735 -0.225301 -0.258621 0.014439 0.018964 -0.255464 -0.256129 -0.254810 -0.248829 -0.203283 -0.205106 -0.203688 -0.204126 -0.216525 -0.218044 0.325925 0.264499 0.284795 0.239830 0.238705 0.230767 0.210179 0.204339 0.287035 0.293569 0.240781 0.245940 0.284203 0.283804 0.285022 0.280443 0.241715 0.240250 0.242014 0.240769 0.237801 0.236668
chargesum: 0.00000
title: Mulliken charges with hydrogens summed into heavy atoms:
elementType: S S O O O O N N C C C C C C C C C C C C C C C C C C C C C C C C C C
charge: 0.855621 0.844191 -0.527171 -0.531587 -0.520356 -0.538406 -0.299385 -0.258100 0.057449 0.026102 0.039226 0.003198 0.071444 -0.010380 0.222051 0.273296 0.015166 0.031252 -0.065329 -0.031166 0.015480 -0.012681 0.014439 0.018964 0.028739 0.027675 0.030211 0.031614 0.038432 0.035143 0.038325 0.036643 0.021276 0.018624
polarizability: 5.35771095e+02 -3.09170597e+01 3.36948049e+02 -2.11574055e+01 -6.75315557e+00 2.66973321e+02
1716.lowfreq: -3.8126 0.0009 0.0011 0.0012 4.6464 12.1778 14.5302 20.1036 26.3592
frequency: 14.4296 20.0984 26.3050 28.2367 31.4219 39.4347 40.2530 59.3692 69.6212 83.5977 90.4651 111.9533 122.0365 133.9270 143.9057 154.3032 162.5845 168.1657 170.4071 181.4967 189.1196 230.5420 249.5688 251.1660 266.8637 269.2047 274.7334 326.0794 345.4976 358.3054 362.9806 364.1846 378.1092 394.0864 404.4601 404.5238 418.6103 434.3241 446.7005 467.9453 475.4740 496.1644 500.6911 507.0081 540.0846 548.8182 591.1521 602.7809 603.4860 611.7389 632.1502 659.7757 661.2713 665.8314 677.8671 691.4834 692.0376 696.0836 713.5009 760.5165 762.4248 771.1118 787.4804 796.2417 800.1338 802.9285 841.3512 850.4712 852.2221 874.6224 907.4733 917.2513 919.7829 923.4826 933.3545 935.0737 942.8328 947.5263 967.8361 978.7035 978.9061 982.7360 983.8624 993.1832 1001.0143 1003.7925 1005.0787 1009.8371 1009.8605 1018.5997 1033.0551 1045.9687 1052.3553 1053.9090 1063.3995 1077.5040 1077.8654 1078.3979 1095.7776 1115.5643 1168.9660 1172.8018 1173.2005 1177.7978 1178.1350 1183.3581 1193.1139 1203.5430 1216.7428 1249.0326 1266.3521 1285.5884 1292.9382 1302.9293 1303.7366 1304.1058 1331.3771 1346.8668 1363.0086 1375.4119 1382.7865 1384.6745 1385.1795 1433.4894 1436.8848 1437.6051 1446.1094 1453.9238 1454.3261 1466.0953 1472.3338 1501.5728 1531.9998 1571.8647 1579.5852 1580.2413 1604.5325 1605.7687 1606.2760 1681.5204 2959.5485 2970.4274 2990.6580 3004.1111 3032.5227 3035.1707 3105.7355 3124.6405 3136.3022 3136.9378 3137.8204 3143.4609 3148.4597 3149.4217 3157.7008 3158.1317 3161.3194 3166.7376 3167.3284 3173.8349 3175.3728 3176.0184
redmass: 6.2988 6.4954 4.7102 5.8742 4.1694 5.7924 6.0464 6.1281 7.3759 6.2766 5.6390 7.5746 4.4957 6.4340 4.6413 5.6880 5.3448 7.5554 5.2129 5.5156 5.1782 5.0119 8.8423 8.7798 7.3384 3.5689 8.8696 5.0193 6.3800 8.0748 11.2106 8.3515 2.1897 5.4016 2.8284 2.8315 6.5366 7.1967 5.3343 4.8088 5.9374 6.0941 4.4416 5.0231 5.8494 8.4438 5.1720 6.4754 6.4720 5.5534 2.5570 5.2490 5.6230 3.1608 3.6228 2.3614 2.3424 3.0333 3.9261 1.4671 1.4618 4.0927 3.1584 2.6127 9.6105 3.7466 2.9571 1.2450 1.2445 4.1289 3.0793 2.7438 9.6115 2.8520 1.3633 1.3580 2.4086 2.5432 1.2976 6.2061 6.2332 1.3894 1.3884 2.3739 1.4222 1.3350 1.3369 3.9295 3.9448 1.4410 2.4276 3.3407 2.1966 2.1861 2.4078 1.7936 1.5613 2.0458 2.0412 1.9596 1.2291 1.0553 1.0557 1.1219 1.1233 1.1349 1.1001 1.2452 1.8322 1.9330 1.4693 1.8497 1.3550 1.6956 1.2988 1.3028 1.4531 1.4586 1.5064 1.6312 9.9455 8.4192 8.4870 2.3412 2.2582 2.2719 1.0876 2.0420 2.0521 1.1019 2.3499 6.5619 8.3638 6.5570 5.8656 5.8924 5.9887 6.9556 6.9965 6.4756 1.0650 1.0669 1.0813 1.0839 1.0966 1.0947 1.0842 1.0929 1.0997 1.0857 1.0859 1.0885 1.0886 1.0886 1.0927 1.0928 1.0937 1.0968 1.0969 1.0997 1.1015 1.1016
irintensity: 0.3760 2.8377 1.0605 1.9075 0.3805 2.5157 0.4789 1.1709 0.1684 0.7475 0.3390 0.2796 0.2210 1.1791 2.0265 0.2484 2.8854 7.7983 6.9975 12.0984 10.5050 1.6379 12.3405 16.9697 0.4127 0.4826 5.0035 2.0860 1.4682 2.6566 25.4502 8.1393 2.3392 1.5245 0.0116 0.0309 14.4706 234.3926 30.0058 2.4085 25.6374 202.6543 20.4037 69.5677 12.7847 52.6506 22.6801 0.0022 0.0415 2.1514 33.8689 6.5541 14.3931 28.3551 9.0992 34.4892 37.8282 4.1500 8.7920 72.4870 70.0816 10.2748 30.2213 22.9662 53.3510 74.8576 17.8707 0.2152 0.7583 3.3354 6.6151 70.4913 13.6738 62.1128 1.5591 1.5028 4.0420 15.3476 0.7635 6.9726 2.4939 0.0411 0.0268 2.8608 4.5909 0.2953 0.3937 4.7191 0.3628 0.6597 18.8860 10.7751 35.3500 21.8947 0.9955 6.3067 1.1614 3.6553 4.3363 1.1029 1.0290 0.0056 0.0202 23.8845 7.1141 5.6565 2.7250 6.2992 23.9459 41.8816 7.7749 22.0444 2.1559 24.4298 3.3264 2.5928 7.6969 2.5386 40.5355 1.4088 4.1135 5.6148 4.8653 7.2361 15.5077 14.6176 23.6790 21.9069 16.6079 12.7260 15.8365 199.6302 159.0246 7.9543 7.4167 5.1770 2.5517 0.4348 0.3355 4.4202 16.2650 26.2993 23.1638 4.3775 4.3415 9.4757 4.3295 18.5237 44.0287 0.7411 1.1516 1.4412 10.9818 10.9709 3.3027 2.4847 7.5776 3.2448 3.2257 20.3664 34.2768 33.0573
temp: 298.150 k
press: 1.00000 atm
elementType: 16 16 8 8 8 8 7 7 6 6 6 6 6 6 6 6 6 6 6 6 6 6 6 6 6 6 6 6 6 6 6 6 6 6 1 1 1 1 1 1 1 1 1 1 1 1 1 1 1 1 1 1 1 1 1 1
symmnumber: 1
zpe: 1092952.2 jmol-1
zpe.correction: 0.416284 hartree
zpe.thermalcorrener: 0.447178 hartree
zpe.thermalcorrenthalpy: 0.448123 hartree
zpe.thermalcorrgfe: 0.350958 hartree
zpe.sumelectzpe: -2207.725304 hartree
zpe.sumelectthermal: -2207.694409 hartree
zpe.sumelectthermalent: -2207.693465 hartree
zpe.sumelectthermalfe: -2207.790629 hartree
dipole: -1.5839 0.7249 -0.5752
dipole: 1.8344
quadrupole: -164.0151 -212.9209 -208.9110
quadrupole: -43.7696 -9.5688 -6.0377
quadrupole: 31.2672 -17.6385 -13.6287 -43.7696 -9.5688 -6.0377
hfenergy: -2208.1415871 hartree
pointgroup: C01 [X(C26H22N2O4S2)]
dipole: 0.6221976 0.2776552 0.2380156 debye
polarizability: 536.1387531|31.0462641|336.4033198|-18.5754466|8.9021116|267.1503916 unknown
InChI: InChI=1S/C26H22N2O4S2/c29-33(30,19-11-3-1-4-12-19)27-25-21-15-7-9-17-23(21)26(24-18-10-8-16-22(24)25)28-34(31,32)20-13-5-2-6-14-20/h1-15,17,22,24H,16,18H2
charge 0 multiplicity 1
56 atoms
S  3.758085 -1.288492 0.038483
S  -3.856523 1.163199 -0.324661
O  3.375295 -2.230736 -1.24096
O  3.718522 -1.902728 1.554446
O  -3.220873 1.475371 -1.796446
O  -4.505147 2.37057 0.572802
N  2.77035 0.372421 -0.043022
N  -2.637764 0.065416 0.755457
C  0.680529 -0.955577 0.547096
C  -0.480838 -0.654616 1.547888
C  0.135882 -1.606685 -0.764737
C  -1.197011 -1.965799 1.938383
C  1.477998 0.30019 0.226554
C  -1.378252 0.4125 0.89291
C  0.740744 1.60193 0.200049
C  -0.658923 1.659532 0.505397
C  -0.824474 -2.735987 -0.448013
C  -1.409667 -2.904043 0.764659
C  1.432852 2.793906 -0.13828
C  -1.31305 2.920279 0.513115
C  0.765819 4.032038 -0.149851
C  -0.607412 4.094954 0.18787
C  5.472457 -0.570745 -0.259811
C  -5.177014 -0.165274 -0.529272
C  6.233045 -0.198619 0.85929
C  -6.199142 -0.233789 0.429762
C  5.923055 -0.478673 -1.585719
C  -5.091465 -1.004078 -1.650761
C  7.531381 0.311317 0.625279
C  -7.196954 -1.219966 0.249904
C  7.223991 0.033882 -1.798005
C  -6.098701 -1.98357 -1.812111
C  8.02015 0.430568 -0.697364
C  -7.142278 -2.092558 -0.862821
H  1.344621 -1.691522 1.039995
H  -0.048081 -0.188876 2.456552
H  0.9975 -1.989329 -1.342941
H  -0.36481 -0.845592 -1.399613
H  -2.174273 -1.727238 2.397925
H  -0.596712 -2.477708 2.718519
H  -1.031442 -3.44561 -1.259859
H  -2.082745 -3.755065 0.931845
H  2.49523 2.721347 -0.387722
H  -2.368142 2.994847 0.79852
H  1.31038 4.94493 -0.412933
H  -1.130904 5.056366 0.198873
H  5.832879 -0.324105 1.870383
H  -6.222873 0.469808 1.267782
H  5.289907 -0.814399 -2.413062
H  -4.280352 -0.881722 -2.375598
H  8.15665 0.610095 1.4729
H  -8.012882 -1.302917 0.975341
H  7.612282 0.119361 -2.818106
H  -6.067089 -2.655226 -2.676185
H  9.027329 0.82503 -0.87033
H  -7.919545 -2.853109 -0.994995
