program: Gaussian 09
title: 000291424
version: EM64L-G09RevD.01
frameworkgroup: C1[X(C7H10ClNO3)]
method: RPBEPBE
basis: SDD
operation: Freq
keyword: #p
keyword: freq=noraman
keyword: PBEPBE/SDD
title: #p freq=noraman PBEPBE/SDD
converged: YES YES NO NO
title: Mulliken charges:
elementType: Cl O O O N C C C C C C C H H H H H H H H H H
charge: -0.067592 -0.311779 -0.243484 -0.289716 -0.615952 0.067202 -0.356490 -0.634598 -0.375609 0.326939 0.245713 -0.485027 0.277937 0.236630 0.221370 0.269856 0.311451 0.243083 0.220033 0.337740 0.341351 0.280942
chargesum: 0.00000
title: Mulliken charges with hydrogens summed into heavy atoms:
elementType: Cl O O O N C C C C C C C
charge: -0.067592 -0.311779 -0.243484 -0.289716 0.063139 0.345139 0.101510 -0.053291 0.087507 0.326939 0.245713 -0.204085
polarizability: 1.04070658e+02 1.55816730e+01 9.72348120e+01 5.86311270e+00 6.43884845e+00 8.48998253e+01
1716.lowfreq: -6.9892 -2.5500 -0.0014 0.0015 0.0019 6.7064 30.8925 56.2909 60.2002
frequency: 30.5635 56.2556 60.1902 67.4060 72.4979 106.0349 163.9567 193.2431 198.0446 270.9415 289.7604 317.6046 363.2981 430.2699 443.5065 502.5609 510.9113 529.9652 572.5830 617.1642 631.3757 655.8989 675.5180 703.2367 774.2907 835.2018 889.2028 932.3991 944.8764 959.4957 998.1643 1024.4818 1049.9658 1058.7940 1120.9758 1161.8525 1228.0612 1245.1456 1273.3108 1293.1661 1308.8851 1342.3833 1356.0410 1372.2921 1432.3908 1438.5515 1447.6478 1589.0089 1688.1626 2136.5925 2973.0219 2989.5822 3011.0748 3050.3306 3063.7680 3086.4952 3152.0681 3422.5572 3559.2591 3716.2134
redmass: 5.7806 8.5262 5.0601 4.7447 3.9477 7.2318 4.4360 4.6339 7.6395 3.6848 4.1439 2.6328 3.0411 3.5632 2.3857 1.2213 1.0563 6.4676 5.3692 4.8079 1.2383 5.4948 1.2619 10.6402 3.4148 4.7665 1.7820 4.4537 4.8633 2.1299 2.3673 2.3200 3.6951 2.0177 2.1878 1.1594 1.1928 1.4337 1.2033 1.5894 1.3767 1.2728 1.7314 1.2857 1.0803 1.0851 1.0931 1.2213 7.1357 5.9960 1.0608 1.0649 1.0815 1.1002 1.0593 1.0997 1.1093 1.1594 1.0447 1.1058
irintensity: 0.4917 0.7764 2.9933 1.3921 12.2711 3.6053 9.5844 0.6229 4.3874 1.6347 7.2408 14.3227 6.6378 15.7695 2.1521 308.4423 1.4580 13.4357 28.2797 9.7734 63.2699 11.6117 56.3857 37.5130 8.4533 21.3211 3.5190 27.3209 88.0719 11.5188 47.1968 44.0999 118.2679 10.5380 9.1507 27.3353 6.1903 34.0577 17.9749 186.6560 74.4752 12.3360 87.6591 5.5697 5.1569 24.6118 19.6228 81.2573 336.4938 0.8022 37.2316 29.0026 4.7466 14.8578 10.3095 18.0368 3.6882 53.4080 66.3147 49.6164
temp: 298.150 k
press: 1.00000 atm
elementType: 17 8 8 8 7 6 6 6 6 6 6 6 1 1 1 1 1 1 1 1 1 1
symmnumber: 1
zpe: 432979.4 jmol-1
zpe.correction: 0.164913 hartree
zpe.thermalcorrener: 0.178622 hartree
zpe.thermalcorrenthalpy: 0.179566 hartree
zpe.thermalcorrgfe: 0.122780 hartree
zpe.sumelectzpe: -1012.220902 hartree
zpe.sumelectthermal: -1012.207193 hartree
zpe.sumelectthermalent: -1012.206249 hartree
zpe.sumelectthermalfe: -1012.263035 hartree
dipole: 1.6482 1.1910 -2.1545
dipole: 2.9626
quadrupole: -80.6584 -74.4006 -72.6937
quadrupole: 5.8586 -7.2806 -5.1641
quadrupole: -4.7408 1.5169 3.2239 5.8586 -7.2806 -5.1641
hfenergy: -1012.3858154 hartree
pointgroup: C01 [X(C7H10Cl1N1O3)]
dipole: 0.1915817 1.0759405 0.4052661 debye
dipolederiv: -0.3428638 0.1631993 -0.1100638 0.1147821 -0.280918 0.066818 -0.1673482 0.1523454 -0.3377462 -0.6550437 -0.4390368 0.2237132 -0.357781 -1.1188477 0.2995048 0.3770296 0.4025853 -0.6853959 -0.6138288 0.2742676 0.068011 0.3524192 -0.7801927 0.1119658 0.0703812 -0.0098106 -0.4893815 -0.4439477 -0.1213816 0.0453652 -0.1213242 -0.6365796 -0.0998754 0.0532411 -0.1128042 -0.9926465 -0.8374692 -0.2397195 -0.135771 -0.1940491 -1.0972917 -0.2010271 -0.1569479 -0.2252487 -0.3617235 0.2159091 0.3342871 -0.1267913 0.1914747 0.7422709 -0.1028993 0.0038447 0.1611388 -0.0074688 0.6911034 -0.392971 0.0410501 -0.210834 0.303899 -0.0033636 -0.0310874 0.0329575 0.3138209 0.2971334 -0.170985 0.304903 -0.2004947 0.2001134 -0.1222342 0.2897195 -0.2490892 0.4095254 0.2985713 -0.0467279 0.0055521 -0.2454962 0.8020902 -0.1377824 -0.0372273 -0.0699939 0.4735727 0.8073658 0.7262753 -0.080169 0.7120525 1.6565096 0.0858493 -0.2443737 -0.0916234 1.4708539 -0.0796373 -0.0033538 -0.0019482 0.0416718 -0.1453071 -0.0870888 0.036089 -0.0406561 -0.0852067 -0.3236027 0.0187927 -0.0157468 0.0446976 -0.3666114 0.0745827 -0.0470079 0.1073621 -0.3172291 0.0402713 -0.0117863 -0.047211 0.0228917 -0.004711 0.0676596 -0.0634961 -0.0509259 0.0296991 0.0346835 -0.0003523 0.0062207 0.0091418 -0.1325304 0.0101942 0.0106058 -0.0295417 0.0843406 -0.0490588 0.0647637 -0.0817236 -0.0107188 0.0733758 -0.0808506 -0.0592132 -0.0239422 -0.0682114 0.0226599 -0.0501942 -0.1066503 -0.0378168 -0.0667811 -0.0055932 -0.0846107 0.000955 0.0215494 -0.0312295 0.0280579 0.0027919 -0.0006248 0.1167478 0.0645675 0.0093536 0.0456634 -0.0180317 -0.0556992 0.0632985 0.108404 0.0515052 0.0088317 0.032027 0.0756024 0.0115212 0.0421183 0.0218299 -0.069566 -0.1556133 0.0005584 -0.0344984 0.0288617 -0.0928945 -0.0124008 -0.03341 0.3663429 -0.0639053 0.0286874 -0.0713479 0.2533993 -0.0054409 0.0423021 0.0237364 0.1716872 0.3655916 -0.0455826 0.0073329 -0.0714436 0.2608915 0.0018147 0.0044834 -0.0368936 0.1707878 0.2709186 -0.0173798 0.0196567 -0.0192637 0.2461399 0.0023101 0.0115545 0.0146651 0.2084958 unknown
polarizability: 84.1535465|-3.6838227|104.6846215|0.8690704|-17.0417007|97.3671271 unknown
InChI: InChI=1S/C7H10ClNO3/c1-2-3-11-5-6(4-8)12-7(9)10/h1,6H,3-5,9H2
charge 0 multiplicity 1
22 atoms
Cl 2.154296 -2.701666 1.048408
O  0.853842 0.22801 0.292321
O  -2.093176 -0.748816 1.017626
O  1.340116 0.637656 -1.982947
N  1.974465 2.12252 -0.277496
C  0.158199 -1.026337 -0.098089
C  -0.773105 -1.382715 1.073476
C  1.160214 -2.123558 -0.454914
C  -2.112782 0.707899 1.264187
C  1.391778 0.982314 -0.775433
C  -1.979461 1.514172 0.035174
C  -1.900076 2.187058 -0.995135
H  -0.438648 -0.825087 -1.010665
H  -1.000002 -2.461741 1.045738
H  -0.257767 -1.151343 2.027115
H  0.640705 -3.02122 -0.824294
H  1.898043 -1.772114 -1.188575
H  -3.097869 0.899301 1.726588
H  -1.318844 0.986091 1.987001
H  1.954351 2.320844 0.719672
H  2.415659 2.767776 -0.926311
H  -1.817238 2.757659 -1.902446
