program: Gaussian 09
title: 000291416
version: EM64L-G09RevD.01
frameworkgroup: C1[X(C7H12O2)]
method: RPBEPBE
basis: SDD
operation: Freq
keyword: #pfreq=noraman
keyword: PBEPBE/SDD
title: #p freq=noraman PBEPBE/SDD
converged: YES YES NO NO
title: Mulliken charges:
elementType: O O C C C C C C C H H H H H H H H H H H H
charge: -0.281487 -0.255083 -0.473561 0.404766 -0.687967 -0.259801 0.142614 -0.665410 -0.662285 0.202649 0.224501 0.217812 0.216705 0.240627 0.235864 0.220372 0.216852 0.225644 0.251111 0.229732 0.256344
chargesum: 0.00000
title: Mulliken charges with hydrogens summed into heavy atoms:
elementType: O O C C C C C C C
charge: -0.281487 -0.255083 -0.046411 0.404766 -0.012824 0.196436 0.142614 0.028197 -0.176209
polarizability: 9.97409345e+01 1.11678059e+01 9.04633181e+01 4.58426075e+00 -1.39638931e+00 5.93217947e+01
1716.lowfreq: -10.0805 -2.9834 0.0005 0.0006 0.0009 2.9401 43.9812 69.5114 83.5139
frequency: 43.9796 69.4724 83.4875 98.4529 169.5968 210.1491 221.3291 255.3363 324.8260 360.0011 392.1094 482.6144 493.3245 564.7134 677.9755 741.8212 783.5067 791.1701 814.5677 841.0940 897.4565 990.2598 1009.1098 1015.9936 1060.2731 1076.1487 1095.0312 1112.6837 1155.3999 1244.5490 1278.1574 1300.1445 1316.3842 1355.3627 1381.7248 1389.4324 1413.7607 1455.6028 1463.4022 1467.2738 1473.9521 1484.2600 1489.9580 1607.1783 1646.0189 2985.8705 2992.5420 2999.6574 3027.9795 3054.5257 3081.5515 3087.7192 3092.2519 3098.4830 3100.5480 3117.9529 3212.4837
redmass: 2.8653 4.5371 2.6651 3.4436 1.7844 1.6062 1.2898 1.6721 2.9025 3.3095 2.7736 4.2254 3.5578 3.2682 1.6394 2.6317 2.2640 1.2002 1.3702 2.9089 2.0197 1.3600 2.1118 2.4972 1.8614 1.5659 2.2195 4.3045 1.6827 1.4567 1.1194 1.7119 1.6316 1.3202 1.1981 1.2306 1.1803 1.0984 1.0432 1.0821 1.0483 1.0514 1.0624 9.5885 5.4503 1.0351 1.0360 1.0598 1.0591 1.1014 1.1000 1.0975 1.1036 1.1009 1.0616 1.1058 1.1154
irintensity: 0.2782 3.6426 0.1234 1.3796 1.1403 2.1515 0.1693 0.7001 9.6441 6.9237 3.5668 2.0481 1.2600 2.2957 9.8069 13.8147 9.5723 7.8146 1.3679 4.8162 5.4135 61.3998 27.0114 29.8260 11.0930 2.9924 63.7121 285.5134 27.1134 34.0598 5.7659 38.8957 12.9003 1.7588 15.7250 22.9991 24.8591 13.8748 14.8390 12.6297 12.2487 13.6115 10.8303 138.0272 2.4707 37.5179 20.2873 27.8102 32.3345 8.1938 40.7916 36.1813 1.2519 36.8812 7.0309 32.0730 5.5018
temp: 298.150 k
press: 1.00000 atm
elementType: 8 8 6 6 6 6 6 6 6 1 1 1 1 1 1 1 1 1 1 1 1
symmnumber: 1
zpe: 463257.5 jmol-1
zpe.correction: 0.176445 hartree
zpe.thermalcorrener: 0.187223 hartree
zpe.thermalcorrenthalpy: 0.188167 hartree
zpe.thermalcorrgfe: 0.139581 hartree
zpe.sumelectzpe: -423.656517 hartree
zpe.sumelectthermal: -423.645739 hartree
zpe.sumelectthermalent: -423.644795 hartree
zpe.sumelectthermalfe: -423.693381 hartree
dipole: 0.0995 -1.7672 0.7231
dipole: 1.9120
quadrupole: -46.1219 -57.7320 -56.0701
quadrupole: 4.4103 1.0640 2.0389
quadrupole: 7.1861 -4.4240 -2.7621 4.4103 1.0640 2.0389
hfenergy: -423.8329621 hartree
pointgroup: C01 [X(C7H12O2)]
dipole: 0.0491932 -0.7503918 0.0184414 debye
dipolederiv: -1.2930393 0.3675108 -0.1454217 0.4498947 -0.7628605 0.1388835 -0.2501496 0.1849906 -0.3773457 -0.7124088 -0.2146253 -0.0576702 -0.0606772 -0.8900491 0.0145734 -0.0907772 -0.0083291 -0.3326387 0.1020947 0.0003717 0.0098638 0.0017886 -0.0229179 0.0614701 -0.0013302 0.0977386 0.0527757 -0.376069 0.1107078 -0.1138245 0.1639106 0.2557074 -0.0794045 -0.1127026 -0.0190723 -0.1090041 0.0708918 -0.0339052 0.0057373 -0.0198626 0.0263274 0.0410715 -0.0053565 -0.0319609 0.0099266 0.8760209 -0.131695 0.0414651 0.018088 0.2268835 0.0152662 0.0855611 -0.0723224 0.3399864 1.5230196 -0.1971263 0.3173507 -0.3938572 1.2225009 -0.1205134 0.3946633 -0.1671129 0.3231425 -0.1238157 0.0282827 0.0595862 -0.016473 0.0522124 0.0030927 0.0549356 0.0498022 -0.1028765 -0.0034857 0.0963503 0.0935714 -0.0911957 -0.1132744 -0.0188763 0.1020166 -0.0037574 -0.3039756 -0.1156073 -0.0754551 -0.1236468 -0.0115481 0.0422713 0.0254092 -0.0961267 -0.0094256 -0.019279 0.0211476 0.0847207 0.1018871 0.0765928 -0.0123331 -0.0394117 0.0782301 -0.0370305 0.0245162 -0.0363557 0.0789859 0.1013414 0.1221162 0.0145448 -0.0740255 0.0610583 -0.0232851 0.0070934 0.0691402 -0.0904011 0.0236687 -0.0970975 -0.1841965 0.0542706 0.011133 0.0434631 0.0503178 -0.053436 0.0043828 -0.1313609 -0.0167084 0.1049629 -0.0281721 -0.0953276 -0.0280371 0.0149681 -0.0127323 0.0363377 0.0177095 -0.0702027 -0.0212954 -0.1293787 -0.0017134 -0.0565581 0.0122841 -0.0156124 0.0312423 -0.0127356 0.0458597 -0.0205163 0.1358856 -0.0356222 0.1010868 -0.023304 -0.1869435 -0.0085517 -0.0538604 -0.0237168 0.1166872 -0.0107401 -0.0399534 -0.0225268 0.0781588 0.1108654 -0.0482239 -0.0086389 -0.0060687 -0.0798429 -0.1142771 0.0254163 -0.0871047 0.0146527 0.1141399 0.0578738 -0.0418486 0.0371414 -0.0181378 0.1044283 -0.0107232 0.0727679 0.0072447 -0.0710494 -0.0380402 -0.0635646 -0.0647349 0.0869537 -0.0132408 -0.0567132 0.0014227 0.1461745 0.1132349 -0.0587428 -0.019609 -0.0432492 -0.0236278 0.0336891 -0.0165184 0.0152508 0.187182 unknown
polarizability: 101.985569|-6.8483561|84.6794882|8.8637658|-9.2790896|62.8609901 unknown
InChI: InChI=1S/C7H12O2/c1-4-6(3)7(8)9-5-2/h3-5H2,1-2H3
charge 0 multiplicity 1
21 atoms
O  0.926248 -0.623399 0.284302
O  0.594169 1.658766 -0.069389
C  -1.681567 -1.377126 -0.271168
C  -1.257876 0.074966 -0.425166
C  -1.888576 -1.791334 1.210204
C  2.355391 -0.34476 0.62147
C  0.142744 0.485812 -0.064476
C  3.216441 -0.328813 -0.645226
C  -2.09082 1.056122 -0.871792
H  -2.623461 -1.532436 -0.830117
H  -0.915754 -2.035891 -0.71982
H  -2.663327 -1.167113 1.690891
H  -2.207949 -2.847543 1.274041
H  -0.949818 -1.682489 1.779598
H  2.409103 0.621088 1.153854
H  2.628666 -1.170903 1.297574
H  4.281284 -0.210708 -0.370863
H  3.10725 -1.272409 -1.207253
H  2.934084 0.513197 -1.298951
H  -3.123724 0.835457 -1.163422
H  -1.743711 2.092418 -0.94779
