program: Gaussian 09
title: 000291439
version: EM64L-G09RevD.01
frameworkgroup: C1[X(C14H11BrN4O4)]
method: RPBEPBE
basis: SDD
operation: Freq
keyword: #p
keyword: freq=noraman
keyword: PBEPBE/SDD
title: #p freq=noraman PBEPBE/SDD
converged: YES YES NO NO
title: Mulliken charges:
elementType: Br O O O O N N N N C C C C C C C C C C C C C C H H H H H H H H H H H
charge: 0.022349 -0.179586 -0.254845 -0.207043 -0.201459 -0.424828 -0.034077 0.027782 0.017232 0.312539 0.258880 0.332529 -0.283118 0.163876 -0.495680 0.448348 -0.367591 -0.347115 -0.349936 -0.875773 -0.240996 -0.225664 -0.226660 0.294334 0.337162 0.294507 0.377974 0.243969 0.257008 0.314491 0.304284 0.235416 0.234321 0.237371
chargesum: 0.00000
title: Mulliken charges with hydrogens summed into heavy atoms:
elementType: Br O O O O N N N N C C C C C C C C C C C C C C
charge: 0.022349 -0.179586 -0.254845 -0.207043 -0.201459 -0.046855 -0.034077 0.027782 0.017232 0.312539 0.258880 0.332529 0.011216 0.163876 -0.158519 0.448348 -0.073083 -0.103146 -0.092927 -0.256999 -0.005581 0.008657 0.010711
polarizability: 4.99371092e+02 2.35052253e+01 2.73336762e+02 -2.00772689e+00 9.40123888e+00 1.00910056e+02
1716.lowfreq: -6.4780 -2.5447 -0.0005 -0.0004 0.0006 2.6369 15.8829 28.5512 37.1968
frequency: 15.7449 28.5063 37.1669 40.1865 49.4069 58.0478 75.1081 81.6901 121.8984 153.0605 160.9066 164.7280 181.7097 221.2504 285.4888 304.6446 325.3875 347.2760 366.3623 386.2261 401.2594 407.9524 432.6402 447.0701 491.4060 505.0840 515.4915 520.4454 599.8739 613.7135 615.2475 650.3153 652.2459 677.5659 683.5000 694.4167 706.9643 724.7539 754.2121 756.6520 783.2106 819.9042 834.3512 849.3656 862.0780 887.1059 919.4149 931.6835 964.4139 981.2859 988.1163 996.5599 1002.7637 1009.7718 1031.0506 1050.5243 1085.8633 1101.8253 1106.4421 1124.7340 1138.5837 1168.9718 1176.3050 1195.9096 1211.4883 1219.6642 1233.3144 1298.5187 1309.5609 1323.8156 1343.9224 1363.0094 1383.0296 1390.2124 1433.8733 1444.8255 1470.4400 1482.2688 1488.6230 1514.8207 1523.0810 1582.7213 1587.1526 1609.6566 1620.0022 3063.7257 3132.1390 3139.0428 3151.1642 3157.6523 3164.0419 3174.5468 3181.0812 3188.9766 3201.0796 3202.5033
redmass: 10.5920 9.9066 8.4146 5.3799 6.3627 14.6443 11.3845 8.8568 7.6784 8.5326 6.7676 7.9812 6.3348 6.8438 5.9779 7.2394 5.0735 4.6272 12.1971 5.0904 2.8851 6.5979 5.7964 4.9811 7.6568 4.2695 3.6909 5.6043 4.7777 6.2142 6.2451 7.4985 6.3472 9.0330 5.1671 1.6808 7.5414 4.9088 8.4029 4.5674 2.1085 1.2729 2.8586 1.2783 1.4322 5.3034 2.4878 1.4213 1.4091 1.5793 3.7657 3.4272 1.3331 1.3251 2.0035 2.0887 1.7882 4.0818 2.5144 1.4972 1.3796 8.6055 1.0560 1.1240 6.6825 1.1739 1.7091 2.3444 2.5786 1.5537 4.9624 7.1273 7.2750 5.0750 2.3816 5.8497 1.8533 2.3627 2.0754 5.2039 2.4121 5.5105 4.3574 5.8912 7.3595 1.0629 1.0853 1.0884 1.0936 1.1036 1.0961 1.1002 1.0898 1.0920 1.0794 1.0956
irintensity: 0.0752 0.5386 0.6082 0.1703 0.2170 0.1243 0.4629 2.7753 3.4429 1.8420 2.2539 3.4427 0.3487 1.6253 2.6750 0.2484 0.2397 5.8886 1.2480 8.8252 2.6690 8.9896 3.8872 5.6426 8.6605 32.2643 6.4865 9.5208 28.3653 0.5458 1.0691 13.6511 9.6947 5.6323 7.4065 52.5142 8.5382 2.8828 30.9671 4.7264 46.6286 95.0872 21.4916 1.5272 27.1408 4.4971 41.8136 4.0152 24.5179 1.3424 3.6224 64.7036 1.1834 0.3702 3.9553 25.2227 19.6199 55.2459 41.0443 8.6784 80.2945 330.8338 0.7140 8.7764 610.3633 30.7233 117.4829 44.3453 12.0339 14.2551 355.8664 50.1523 0.7027 73.3355 13.7515 0.9522 47.6303 32.2814 149.7308 56.5716 19.1955 35.5349 133.3583 20.7337 455.6307 8.3777 2.9995 1.2898 18.3814 1.6594 26.1619 23.8859 3.4028 20.1338 67.4078 3.0905
temp: 298.150 k
press: 1.00000 atm
elementType: 35 8 8 8 8 7 7 7 7 6 6 6 6 6 6 6 6 6 6 6 6 6 6 1 1 1 1 1 1 1 1 1 1 1
symmnumber: 1
zpe: 621195.6 jmol-1
zpe.correction: 0.236601 hartree
zpe.thermalcorrener: 0.256765 hartree
zpe.thermalcorrenthalpy: 0.257709 hartree
zpe.thermalcorrgfe: 0.183481 hartree
zpe.sumelectzpe: -1071.640794 hartree
zpe.sumelectthermal: -1071.620629 hartree
zpe.sumelectthermalent: -1071.619685 hartree
zpe.sumelectthermalfe: -1071.693914 hartree
dipole: 7.9021 3.0560 -1.3947
dipole: 8.5865
quadrupole: -166.7007 -149.0065 -142.6809
quadrupole: 9.5449 -1.1904 -1.9233
quadrupole: -13.9047 3.7895 10.1151 9.5449 -1.1904 -1.9233
hfenergy: -1071.8773947 hartree
pointgroup: C01 [X(C14H11Br1N4O4)]
dipole: -3.2467196 -0.763328 -0.5368287 debye
polarizability: 501.3262348|-2.6513269|270.7374596|-13.0622678|11.4412196|101.5542155 unknown
InChI: InChI=1S/C14H11BrN4O4/c15-9-13(10-4-2-1-3-5-10)17-16-12-7-6-11(18(20)21)8-14(12)19(22)23/h1-8,16H,9H2
charge 0 multiplicity 1
34 atoms
Br -2.494085 3.107764 1.37848
O  3.450645 3.060138 -0.384577
O  1.174291 3.038127 -0.330488
O  5.045202 -2.977414 0.236449
O  6.064601 -0.938666 0.064476
N  -0.108102 0.782735 -0.142999
N  -1.239904 0.000703 -0.104315
N  2.337535 2.424116 -0.293542
N  5.014787 -1.68911 0.121494
C  1.138442 0.186494 -0.081214
C  2.351495 0.966871 -0.145336
C  -3.622797 -0.278583 -0.110736
C  1.266079 -1.233526 0.049883
C  -2.427871 0.598914 -0.194677
C  3.619446 0.349838 -0.078973
C  3.690669 -1.041461 0.05114
C  2.516724 -1.842722 0.116939
C  -4.903443 0.253847 0.209784
C  -3.504559 -1.679509 -0.343807
C  -2.6044 2.079299 -0.396118
C  -6.031115 -0.590183 0.292025
C  -4.632565 -2.517303 -0.265512
C  -5.90315 -1.976976 0.051578
H  0.345919 -1.817375 0.104261
H  4.52677 0.956971 -0.131043
H  2.619461 -2.925883 0.221966
H  -0.092001 1.824464 -0.173819
H  -5.022323 1.319131 0.435831
H  -2.521926 -2.089607 -0.594078
H  -3.590364 2.333325 -0.80217
H  -1.821943 2.539994 -1.019528
H  -7.007047 -0.165762 0.550388
H  -4.526775 -3.590683 -0.456546
H  -6.780798 -2.629667 0.110488
