program: Gaussian 09
title: 000291423
version: EM64L-G09RevD.01
frameworkgroup: C1[X(C11H16O2)]
method: RPBEPBE
basis: SDD
operation: Freq
keyword: #pfreq=noraman
keyword: PBEPBE/SDD
title: #p freq=noraman PBEPBE/SDD
converged: YES YES NO NO
title: Mulliken charges:
elementType: O O C C C C C C C C C C C H H H H H H H H H H H H H H H H
charge: -0.297630 -0.304708 0.262263 -0.466791 -0.488261 -0.406564 -0.402748 -0.388027 -0.043631 -0.286829 -0.352677 0.215375 -0.535551 0.216038 0.211959 0.215559 0.228322 0.217974 0.201587 0.203454 0.217963 0.188216 0.206190 0.241896 0.212090 0.204328 0.221880 0.221903 0.286420
chargesum: 0.00000
title: Mulliken charges with hydrogens summed into heavy atoms:
elementType: O O C C C C C C C C C C C
charge: -0.297630 -0.304708 0.262263 -0.038794 -0.044380 0.012997 0.018668 0.006379 0.198265 0.129588 0.091107 0.215375 -0.249132
polarizability: 1.35054837e+02 -4.65962311e+00 1.19713589e+02 -4.70391458e-01 -2.79188263e+00 9.96237162e+01
1716.lowfreq: -6.1478 -3.5824 -0.0006 0.0004 0.0007 13.2225 22.4142 38.9773 95.5787
frequency: 21.2772 38.7820 95.4961 100.4658 113.4443 128.8415 188.8148 233.4401 242.5727 271.4667 311.3561 372.3186 387.3193 404.9860 431.2336 453.4553 507.0844 544.3975 626.1771 630.9698 661.2972 665.1741 751.9089 786.3041 794.6220 821.7640 845.0624 890.7708 892.7323 915.8251 936.4221 943.2699 969.4254 989.8825 1018.0841 1026.6723 1048.7024 1071.3651 1095.7672 1098.0462 1110.9979 1133.7631 1140.7478 1164.1040 1203.8736 1212.5148 1239.1669 1251.6763 1265.1519 1280.8680 1306.6750 1327.6472 1337.4941 1342.1556 1347.4565 1355.8052 1410.0679 1458.1960 1463.9037 1464.1135 1473.2196 1476.0236 1479.3377 1487.9017 2120.2616 2962.8900 2968.7595 2981.1966 2982.3919 2986.0863 2998.1204 3022.4824 3034.0397 3038.5467 3046.4236 3055.4582 3068.4568 3070.9202 3109.1893 3177.3743 3424.2295
redmass: 2.9737 4.6646 3.8236 3.6419 3.6117 3.2540 3.6249 2.5535 2.5903 5.4327 2.2350 3.1420 2.3491 2.6302 3.4321 3.6208 2.0318 4.4625 3.9757 1.2226 4.4089 1.2593 7.2056 1.4743 4.1439 2.2064 2.1275 2.5747 1.2442 2.2686 1.4313 2.0455 1.7636 4.2771 3.7650 1.4114 1.8599 1.4052 1.4765 1.3688 1.3205 1.7534 1.5783 2.3151 1.3099 1.9729 1.4382 1.3313 1.2531 1.6115 1.3793 1.4027 1.3689 1.4549 1.3796 1.4354 1.9602 1.0838 1.0889 1.0857 1.0864 1.2185 1.0970 1.1059 6.0365 1.0554 1.0633 1.0613 1.0614 1.0621 1.0629 1.1059 1.0957 1.1000 1.1016 1.1032 1.0530 1.1019 1.0916 1.1191 1.1584
irintensity: 0.9307 1.7609 1.4975 3.1115 2.8229 1.2018 2.7150 3.0634 6.2984 8.1564 1.0873 4.5646 3.4417 3.7707 1.8953 3.0160 6.4322 2.1848 0.7825 69.9695 0.6578 59.3323 7.5800 1.3923 36.4829 1.9169 14.2823 8.3176 3.3416 18.0298 3.4328 9.4658 4.1595 85.2938 127.6352 0.7386 1.9733 1.5674 1.7051 3.9452 11.6563 2.2409 1.8710 10.0420 0.8072 2.9885 2.1471 5.3235 1.0601 17.6024 0.5649 13.2378 0.3089 0.6017 3.9639 4.7990 0.9996 4.4350 6.7302 11.3350 14.1198 8.4788 1.8435 7.1621 0.3703 34.8063 36.2116 27.9854 29.8339 23.2838 18.5186 28.2029 59.6364 54.7948 36.9065 44.7078 23.3892 39.4794 18.4381 32.5981 59.7226
temp: 298.150 k
press: 1.00000 atm
elementType: 8 8 6 6 6 6 6 6 6 6 6 6 6 1 1 1 1 1 1 1 1 1 1 1 1 1 1 1 1
symmnumber: 1
zpe: 640640.2 jmol-1
zpe.correction: 0.244007 hartree
zpe.thermalcorrener: 0.257556 hartree
zpe.thermalcorrenthalpy: 0.258500 hartree
zpe.thermalcorrgfe: 0.202788 hartree
zpe.sumelectzpe: -578.073295 hartree
zpe.sumelectthermal: -578.059746 hartree
zpe.sumelectthermalent: -578.058802 hartree
zpe.sumelectthermalfe: -578.114514 hartree
dipole: 2.5017 0.3839 0.5670
dipole: 2.5937
quadrupole: -86.1872 -72.2398 -78.6011
quadrupole: -3.1219 -7.2517 -0.7846
quadrupole: -7.1778 6.7696 0.4082 -3.1219 -7.2517 -0.7846
hfenergy: -578.3173023 hartree
pointgroup: C01 [X(C11H16O2)]
dipole: -0.9919274 0.1415771 -0.1932945 debye
polarizability: 135.0429589|4.316273|119.9282282|-2.6684468|0.205595|99.4209554 unknown
InChI: InChI=1S/C11H16O2/c1-2-11(6-4-3-5-7-11)13-9-10-8-12-10/h1,10H,3-9H2
charge 0 multiplicity 1
29 atoms
O  0.66774 -0.621527 -0.502219
O  4.31167 -0.464285 0.429708
C  -0.660355 -0.067167 -0.098933
C  -1.200816 -0.779729 1.175814
C  -1.569089 -0.390913 -1.314324
C  -2.68335 -0.425803 1.448166
C  -3.050115 -0.039482 -1.046143
C  -3.574608 -0.74744 0.225807
C  3.021774 -0.898233 -0.231666
C  1.766558 -0.408374 0.457821
C  3.932419 0.049302 -0.943719
C  -0.553524 1.397811 0.114514
C  -0.43538 2.61366 0.285496
H  -0.58544 -0.516859 2.055948
H  -1.098648 -1.869524 1.001981
H  -1.463862 -1.475984 -1.508053
H  -1.185445 0.144223 -2.200825
H  -2.763294 0.652568 1.690726
H  -3.032496 -0.98219 2.338911
H  -3.657371 -0.327714 -1.925215
H  -3.155639 1.057461 -0.929127
H  -3.583063 -1.844422 0.057424
H  -4.619859 -0.444731 0.427682
H  3.011394 -1.950346 -0.544045
H  1.864721 0.664975 0.71685
H  1.593683 -0.985739 1.389109
H  4.563325 -0.317622 -1.761909
H  3.667833 1.113486 -0.978842
H  -0.341962 3.674197 0.432365
