program: Gaussian 09
title: 000291462
version: EM64L-G09RevD.01
frameworkgroup: C1[X(C18H20N2O6S)]
method: RPBEPBE
basis: SDD
operation: Freq
keyword: #p
keyword: freq=noraman
keyword: PBEPBE/SDD
title: #p freq=noraman PBEPBE/SDD
converged: NO YES NO NO
title: Mulliken charges:
elementType: S O O O O O O N N C C C C C C C C C C C C C C C C C C H H H H H H H H H H H H H H H H H H H H
charge: 0.809958 -0.525771 -0.525401 -0.177431 -0.177397 -0.176813 -0.177146 -0.003096 -0.002620 -0.335683 -0.336221 0.239651 0.238887 0.595438 0.595306 0.116868 0.116777 0.371407 0.371922 -0.656788 -0.656366 -0.809151 -0.809953 -0.847742 -0.848728 -0.797633 -0.797362 0.258253 0.258235 0.267192 0.299550 0.239207 0.267125 0.300468 0.239564 0.290216 0.258536 0.242467 0.258588 0.242787 0.290107 0.275066 0.228999 0.242488 0.228885 0.242490 0.274863
chargesum: 0.00000
title: Mulliken charges with hydrogens summed into heavy atoms:
elementType: S O O O O O O N N C C C C C C C C C C C C C C C C C C
charge: 0.809958 -0.525771 -0.525401 -0.177431 -0.177397 -0.176813 -0.177146 -0.003096 -0.002620 -0.335683 -0.336221 0.239651 0.238887 0.595438 0.595306 0.116868 0.116777 0.371407 0.371922 -0.398534 -0.398131 -0.003202 -0.002795 -0.056523 -0.057245 -0.051081 -0.051124
polarizability: 3.76123632e+02 1.21033731e+01 2.42781943e+02 -1.99286917e-02 2.23024633e-01 2.01913909e+02
1716.lowfreq: -5.3772 -3.0240 0.0015 0.0016 0.0018 6.6028 22.1625 30.5507 31.4160
frequency: 22.1145 30.4899 31.3845 44.8329 62.8850 68.5133 75.9638 77.5147 97.3286 115.8560 118.7831 134.6144 140.3598 142.1984 159.3218 164.8579 178.7873 183.8760 196.8299 199.8120 202.5312 223.9078 227.6038 237.7780 241.5897 245.6659 259.5241 301.0042 305.6638 320.2463 324.9915 341.5065 352.5261 369.4028 373.0824 420.8004 437.8145 445.4783 449.8551 522.2594 523.0795 531.3956 533.0393 542.6926 548.2365 570.6254 573.1741 597.7918 604.7803 634.0708 636.5379 699.6809 700.0260 743.8056 748.1616 770.1540 770.7064 791.1515 883.3829 884.5713 906.5888 945.1313 945.3477 947.7263 953.8361 1029.5297 1029.9478 1034.4141 1034.8843 1044.1617 1045.2754 1047.2589 1048.7494 1053.7710 1056.9502 1067.2843 1067.6522 1072.0064 1072.7805 1224.6098 1225.6843 1241.7379 1242.2078 1302.9881 1304.3934 1344.8076 1345.5795 1357.4980 1358.1108 1387.4075 1388.2192 1393.9593 1395.9117 1403.0421 1405.5229 1408.8373 1409.7827 1416.3792 1416.6224 1463.8332 1464.1472 1466.4472 1467.8070 1473.0601 1474.2651 1479.5082 1480.1868 1484.0038 1485.9763 1492.3613 1493.2750 1568.3668 1568.7523 1589.6168 1589.7993 2992.0798 2992.8582 2997.2618 2997.4165 3000.9804 3001.3478 3077.0515 3078.1505 3079.9444 3080.2262 3080.4817 3080.7031 3102.2888 3102.5685 3105.7639 3105.9343 3130.3866 3131.0447 3141.8059 3142.0710
redmass: 6.5279 6.4218 5.2453 4.5174 7.2380 6.1057 3.2891 3.2439 2.7982 1.3410 1.6741 3.1692 1.1090 1.1240 1.6747 5.5394 2.1784 1.7045 3.5874 4.3443 1.9596 6.7800 5.9914 3.6337 4.3930 4.1708 4.8737 3.3272 3.5091 4.5785 4.8273 5.2805 5.5847 3.6652 3.1992 6.4725 6.7580 5.1968 6.5586 3.5964 3.6926 4.4924 4.7058 3.8547 3.4273 4.5608 4.6960 6.7134 6.8688 5.6589 6.0014 6.2848 6.4665 4.9145 4.7232 9.8903 9.6956 17.0199 1.2993 1.2926 13.7048 2.8244 3.2367 3.3891 3.8063 1.6108 1.6288 1.7022 1.7113 1.6113 1.6322 1.5458 1.5512 1.6106 1.5915 3.6061 2.7104 2.1374 2.2639 3.5740 3.3490 2.2787 2.1914 8.2969 7.8031 6.7532 6.4659 5.9221 6.3187 4.3903 4.7737 2.6802 2.5013 1.2278 1.2534 1.2120 1.2405 1.2564 1.2593 1.0747 1.0751 1.0503 1.0513 1.0772 1.0900 1.1149 1.1127 1.1127 1.1124 1.1107 1.1123 7.5496 7.5676 5.6792 5.6603 1.0375 1.0375 1.0375 1.0374 1.0391 1.0390 1.0966 1.0966 1.0970 1.0971 1.0967 1.0969 1.0997 1.0997 1.1002 1.1002 1.0995 1.0995 1.0918 1.0917
irintensity: 0.5112 1.3333 1.0382 1.8489 1.0019 2.3289 0.5265 0.5187 0.3284 2.0120 0.8391 0.6311 2.0994 1.8399 0.0461 6.0531 6.4867 0.0509 1.0677 1.5637 0.2194 3.3993 0.8634 0.7050 0.1984 2.3524 2.9348 0.0873 7.6703 16.2319 0.5357 1.4724 3.6501 1.1565 0.5407 22.9419 59.8161 1.0469 85.7891 1.6019 0.4740 0.6112 0.1474 26.2401 10.8036 1.1148 28.9970 0.2225 6.7693 2.9831 0.0360 0.1573 1.0340 1.3788 0.0623 0.9362 67.9707 72.4697 13.1726 7.6631 74.2010 0.1619 0.4749 5.6152 0.3860 9.4777 0.8643 23.3025 0.6535 3.5781 1.9718 0.5406 0.0037 16.0237 16.6272 2.2242 0.4263 1.5111 0.5870 236.5576 2.0133 67.9994 71.0458 9.4309 2.2932 2.8872 0.4580 156.9996 21.2897 164.6967 3.1400 12.5831 2.5463 74.8280 2.8413 5.3217 9.2982 13.3977 13.9600 4.9791 19.6195 20.0121 16.1255 4.7058 55.2016 30.5309 32.3544 7.2795 32.6616 70.0107 16.4843 12.1512 11.9268 9.5612 36.8966 9.9499 7.9085 9.8246 11.1303 15.5025 4.9695 15.0955 4.6061 7.4524 7.7487 16.6350 12.5919 12.2660 1.4532 13.8121 13.5441 8.6882 6.0488 9.1642 7.3661
temp: 298.150 k
press: 1.00000 atm
elementType: 16 8 8 8 8 8 8 7 7 6 6 6 6 6 6 6 6 6 6 6 6 6 6 6 6 6 6 1 1 1 1 1 1 1 1 1 1 1 1 1 1 1 1 1 1 1 1
symmnumber: 1
zpe: 920974.9 jmol-1
zpe.correction: 0.350781 hartree
zpe.thermalcorrener: 0.379513 hartree
zpe.thermalcorrenthalpy: 0.380457 hartree
zpe.thermalcorrgfe: 0.291056 hartree
zpe.sumelectzpe: -1654.501933 hartree
zpe.sumelectthermal: -1654.473201 hartree
zpe.sumelectthermalent: -1654.472257 hartree
zpe.sumelectthermalfe: -1654.561658 hartree
dipole: 0.0168 0.0447 -6.2025
dipole: 6.2027
quadrupole: -202.7407 -163.3269 -170.6964
quadrupole: -19.5921 -0.1949 0.0290
quadrupole: -23.8194 15.5944 8.2249 -19.5921 -0.1949 0.0290
hfenergy: -1654.852714 hartree
pointgroup: C01 [X(C18H20N2O6S1)]
dipole: -0.0744289 -2.4167305 -0.3301597 debye
polarizability: 375.6470812|-2.8012626|202.710469|-14.393083|-5.210547|242.4619336 unknown
InChI: InChI=1S/C18H20N2O6S/c1-9-7-11(3)17(13(5)15(9)19(21)22)27(25,26)18-12(4)8-10(2)16(14(18)6)20(23)24/h7-8H,1-6H3
charge 0 multiplicity 1
47 atoms
S  0.017049 1.649373 0.191265
O  0.235843 2.687788 -1.052557
O  -0.153266 2.324343 1.670465
O  -6.133657 0.050239 0.048376
O  6.070531 -0.267182 -0.136832
O  -4.997377 -0.69631 1.878703
O  4.908321 -0.440829 -2.090727
N  -5.047154 -0.288787 0.655779
N  4.971408 -0.373207 -0.803989
C  -1.517678 0.558858 -0.338947
C  1.483604 0.370664 0.39964
C  -2.716297 0.573613 0.42038
C  2.688425 0.520836 -0.334655
C  -1.368231 -0.136708 -1.571755
C  1.284074 -0.619603 1.402314
C  -3.772799 -0.222952 -0.109177
C  3.696875 -0.442106 -0.039719
C  -3.701015 -0.959448 -1.315795
C  3.575219 -1.464733 0.931488
C  -2.478762 -0.894014 -2.018018
C  2.350018 -1.523893 1.629313
C  -2.946691 1.379323 1.687737
C  2.970847 1.619591 -1.345239
C  -0.125104 -0.109695 -2.441406
C  0.030617 -0.763251 2.244688
C  -4.852588 -1.781634 -1.855805
C  4.677367 -2.458425 1.234158
H  -2.382824 -1.448108 -2.958029
H  2.215737 -2.301496 2.389096
H  -2.877651 0.726001 2.57591
H  -2.21266 2.186871 1.803439
H  -3.961636 1.81181 1.690569
H  2.887502 1.225427 -2.373701
H  2.272213 2.459785 -1.245733
H  4.002847 1.992996 -1.23145
H  0.200906 0.927032 -2.632557
H  0.719194 -0.643694 -1.969613
H  -0.326844 -0.599542 -3.407258
H  -0.826339 -1.120968 1.646107
H  0.196335 -1.493404 3.052822
H  -0.256238 0.20224 2.694733
H  -5.665376 -1.126855 -2.215456
H  -4.515635 -2.415313 -2.691721
H  -5.294538 -2.436113 -1.083179
H  4.298142 -3.271324 1.873844
H  5.096096 -2.908155 0.316096
H  5.51689 -1.96384 1.753096
