program: Gaussian 09
title: 000291405
version: EM64L-G09RevD.01
frameworkgroup: C1[X(C17H12N2O2)]
method: RPBEPBE
basis: SDD
operation: Freq
keyword: #p
keyword: freq=noraman
keyword: PBEPBE/SDD
title: #p freq=noraman PBEPBE/SDD
converged: YES YES NO NO
title: Mulliken charges:
elementType: O O N N C C C C C C C C C C C C C C C C C H H H H H H H H H H H H
charge: -0.214598 -0.214591 0.025654 -0.012667 0.535933 0.511494 -0.369515 -0.382849 0.370843 -0.344562 -0.372197 -0.374869 -0.328406 -0.529218 -0.383583 -0.188780 -0.197414 0.377400 -0.216054 -0.372667 -0.261328 0.233697 0.241071 0.230447 0.286475 0.287569 0.227048 0.257949 0.232641 0.221844 0.220564 0.239231 0.263435
chargesum: 0.00000
title: Mulliken charges with hydrogens summed into heavy atoms:
elementType: O O N N C C C C C C C C C C C C C C C C C
charge: -0.214598 -0.214591 0.025654 -0.012667 0.535933 0.511494 -0.135818 -0.141777 0.370843 -0.114114 -0.085722 -0.087300 -0.101358 -0.271269 -0.150941 0.033064 0.023150 0.377400 0.023176 -0.109232 -0.261328
polarizability: 7.02465658e+02 -1.38084455e+01 2.10036805e+02 3.30191165e-02 -4.45725041e-03 7.61177672e+01
1716.lowfreq: -0.0003 0.0002 0.0009 3.6585 6.1924 14.9339 21.4625 30.8405 32.7041
frequency: 21.1113 30.8181 32.7041 56.3052 71.9039 97.8939 115.5469 133.7709 145.6769 178.9347 184.4049 221.4727 236.2058 307.7616 314.5078 344.9359 361.1603 384.2290 413.3470 445.0006 466.7549 474.4710 492.5079 505.4850 516.2011 557.9363 621.8779 626.4960 637.7489 655.1559 664.0240 692.4705 738.9558 741.4165 772.8215 813.1787 836.4613 840.5948 843.5502 872.1547 909.6144 922.2217 923.7650 927.9578 944.6500 984.8908 988.7299 995.1885 995.2403 1000.5629 1007.7407 1094.9958 1097.6820 1110.1936 1167.1985 1177.0746 1180.9027 1190.2433 1218.3379 1229.6077 1241.9471 1261.6896 1291.6882 1299.8477 1312.5878 1326.9283 1336.6979 1359.0934 1383.1165 1400.3245 1421.0808 1430.3587 1479.0234 1483.3192 1577.5503 1579.6508 1594.4391 1601.7605 1620.1523 1632.1403 2181.6496 3089.2141 3090.2935 3097.9361 3109.6798 3137.3310 3140.6156 3143.5692 3152.3995 3157.3104 3174.5048 3182.2798 3184.6249
redmass: 6.3560 6.3621 7.8546 5.3677 6.2299 8.1415 4.2853 7.9484 4.6122 2.5226 8.4756 3.7030 6.3352 5.1997 2.9269 4.0175 8.2728 4.2196 2.8890 6.7620 5.8734 3.3569 6.4428 3.1932 6.0432 6.6162 5.0203 7.0142 6.5583 6.1118 4.4778 1.7929 3.9599 5.9482 8.5462 1.5273 1.4278 5.0506 1.3713 1.7087 1.9636 3.6340 1.4923 1.5158 1.2992 6.1578 1.3098 1.3575 1.3741 3.0262 1.1358 3.1593 1.7219 1.3779 1.7678 2.4775 1.6193 1.1263 2.7420 1.4031 2.7176 2.1757 1.6212 1.3357 1.3935 1.3529 1.9153 5.8862 7.0228 4.6130 3.4949 3.5467 2.4420 2.5317 5.2256 7.0507 5.4347 5.9652 5.6203 5.2587 12.6326 1.0917 1.0918 1.0882 1.0873 1.0906 1.0866 1.0926 1.0890 1.0926 1.0993 1.0946 1.0958
irintensity: 1.3527 0.0698 2.6879 0.2340 0.1280 1.3897 2.3544 0.6945 0.5089 0.3234 2.4381 0.7926 0.6405 1.6704 0.0506 0.1136 4.0172 0.2027 0.0038 3.0149 0.2342 11.5669 2.2662 5.6281 2.3582 1.7739 0.1222 0.8447 5.4379 0.0458 25.8975 24.5191 5.3070 4.8761 26.9677 49.5370 4.6577 10.6384 10.9552 20.1798 19.5250 9.9105 0.0193 11.9374 0.4631 0.2936 32.8597 0.4389 0.3731 0.0409 91.8988 40.6075 5.4636 17.5318 6.8281 1.2233 395.1437 8.2455 714.1689 69.1245 13.2820 2.2424 4.2198 0.5392 7.2039 2.1110 8.1597 89.6660 4.1843 24.5419 8.1614 24.0553 17.1650 0.0441 6.3474 7.0768 189.1486 180.5499 59.8046 0.6165 40.8388 9.8633 0.8470 0.5806 60.8518 10.8646 3.5082 5.0826 5.3704 6.9939 11.6224 0.1239 1.6166
temp: 298.150 k
press: 1.00000 atm
elementType: 8 8 7 7 6 6 6 6 6 6 6 6 6 6 6 6 6 6 6 6 6 1 1 1 1 1 1 1 1 1 1 1 1
symmnumber: 1
zpe: 640059.3 jmol-1
zpe.correction: 0.243786 hartree
zpe.thermalcorrener: 0.261840 hartree
zpe.thermalcorrenthalpy: 0.262784 hartree
zpe.thermalcorrgfe: 0.194855 hartree
zpe.sumelectzpe: -913.414757 hartree
zpe.sumelectthermal: -913.396703 hartree
zpe.sumelectthermalent: -913.395759 hartree
zpe.sumelectthermalfe: -913.463688 hartree
dipole: -3.5096 -4.6701 -0.0064
dipole: 5.8418
quadrupole: -211.9165 -114.2615 -126.8927
quadrupole: 17.9400 -0.0168 0.0232
quadrupole: -60.8929 36.7620 24.1309 17.9400 -0.0168 0.0232
hfenergy: -913.6585428 hartree
pointgroup: C01 [X(C17H12N2O2)]
dipole: -1.3633312 1.8493823 -0.0594514 debye
polarizability: 702.6677691|9.0346334|209.6329797|-3.3859736|-4.9950476|76.3194811 unknown
InChI: InChI=1S/C17H12N2O2/c18-13-16-7-3-6-15(12-16)5-2-1-4-14-8-10-17(11-9-14)19(20)21/h1-12H
charge 0 multiplicity 1
33 atoms
O  7.216682 -1.874159 0.039684
O  7.80616 0.330654 -0.053452
N  6.923709 -0.614639 -0.009137
N  -7.861091 -2.282237 0.124382
C  2.761393 0.488287 -0.026256
C  -3.624682 0.238257 0.009429
C  3.158189 -0.885214 0.02454
C  3.787982 1.481599 -0.070324
C  5.497332 -0.233932 -0.015133
C  1.36377 0.921001 -0.035286
C  4.511934 -1.249521 0.030437
C  5.148176 1.134463 -0.065618
C  -2.221241 -0.189414 0.017584
C  -4.640173 -0.756788 0.050506
C  -4.028535 1.607452 -0.037286
C  0.2464 0.113108 -0.003037
C  -1.107369 0.620984 -0.014979
C  -6.013187 -0.40267 0.045904
C  -5.391435 1.960083 -0.042162
C  -6.394114 0.966468 -0.000803
C  -7.022588 -1.43035 0.088697
H  2.400561 -1.674099 0.060192
H  3.503194 2.53937 -0.109298
H  1.203589 2.008703 -0.072674
H  4.827613 -2.295362 0.069592
H  5.938512 1.888663 -0.09967
H  -2.057298 -1.276839 0.054454
H  -4.361006 -1.815853 0.086909
H  -3.273796 2.399898 -0.06996
H  0.359518 -0.979882 0.033507
H  -1.221773 1.713759 -0.0517
H  -5.680133 3.015571 -0.078493
H  -7.45419 1.237135 -0.004349
