program: Gaussian 09
title: 000291421
version: EM64L-G09RevD.01
frameworkgroup: C1[X(C18H16O5)]
method: RPBEPBE
basis: SDD
operation: Freq
keyword: #pfreq=noraman
keyword: PBEPBE/SDD
title: #p freq=noraman PBEPBE/SDD
converged: YES YES NO NO
title: Mulliken charges:
elementType: O O O O O C C C C C C C C C C C C C C C C C C H H H H H H H H H H H H H H H H
charge: -0.267747 -0.255333 -0.305416 -0.291419 -0.254905 0.183199 0.167368 0.350411 -0.453592 -0.333045 -0.359895 -0.203372 0.550107 0.080971 -0.512432 -0.299643 0.209110 -0.294876 -0.413507 0.187557 -0.352811 -0.530142 -0.529671 0.243851 0.255614 0.286386 0.240150 0.241418 0.249957 0.275225 0.207164 0.243807 0.254725 0.250791 0.226645 0.233441 0.227450 0.232669 0.259790
chargesum: 0.00000
title: Mulliken charges with hydrogens summed into heavy atoms:
elementType: O O O O O C C C C C C C C C C C C C C C C C C
charge: -0.267747 -0.255333 -0.305416 -0.291419 -0.254905 0.183199 0.167368 0.350411 -0.209741 -0.077432 -0.073508 0.278196 0.550107 0.080971 -0.262475 -0.024418 0.209110 -0.087712 -0.169700 0.187557 -0.098086 0.180735 0.190239
polarizability: 4.53324663e+02 -4.90616580e+00 2.38716434e+02 -5.68370905e+00 -2.57951447e+00 1.02170812e+02
1716.lowfreq: -36.4709 -3.8029 0.0003 0.0008 0.0008 2.2794 5.0549 12.5851 24.3282
frequency: -36.4417 11.3607 24.2646 32.0757 51.4794 87.5336 92.8813 115.2533 126.7679 130.7770 153.6819 156.9202 164.5511 186.5135 194.4613 219.7824 246.1859 264.6743 289.5940 305.5913 349.4572 353.6659 387.3720 412.4292 417.7767 442.3753 478.7866 516.5230 523.4974 555.1027 567.4335 578.1472 630.5950 653.2260 683.0220 702.8444 708.4117 722.8479 735.4767 754.0582 780.4477 807.3353 834.0717 838.8517 842.3477 870.4302 883.7041 887.1830 899.7643 915.3179 944.2488 960.8204 975.8058 978.8995 985.4781 1017.0353 1019.2996 1061.4686 1064.1390 1094.6791 1113.5166 1114.6110 1120.4441 1136.2356 1141.9060 1154.4347 1156.5334 1200.1689 1208.4651 1236.6469 1248.4749 1254.6136 1262.4869 1316.7133 1339.2222 1362.9169 1366.9782 1381.8572 1410.6910 1426.0666 1443.4468 1444.5056 1457.8966 1460.1942 1474.6351 1475.9629 1484.4176 1487.4419 1488.3683 1512.4892 1556.5387 1600.2607 1607.3389 1620.0134 1636.8597 2973.8917 2980.8773 3016.3361 3069.8127 3081.0555 3096.7994 3097.6669 3123.5892 3128.7177 3138.1515 3147.5487 3156.1792 3161.4755 3168.0856 3183.9120 3189.6119
redmass: 2.2985 4.9486 5.3884 6.2638 4.6302 3.9127 5.3254 3.2062 3.7779 3.8439 1.3212 1.5276 1.5705 6.4373 3.3110 5.5746 4.7766 7.3003 4.0042 7.5207 4.9914 7.6037 6.5239 2.9100 3.8350 5.4477 3.6449 5.1123 5.9539 5.1380 7.0248 4.7410 3.7290 7.3393 9.8194 5.3940 6.0456 5.9929 3.0914 3.1595 6.7969 6.0594 1.4292 6.5978 1.5258 1.6645 1.9477 4.5407 1.8372 4.2394 7.8552 1.3712 6.2430 1.3496 3.2718 1.2523 2.5169 3.8537 1.4599 2.7941 1.2430 1.2428 1.0374 1.3182 1.5346 1.3178 1.5916 1.9656 1.7709 1.8360 3.6834 1.5461 1.5973 2.0078 2.1645 1.4798 3.8444 3.7975 2.2909 1.1907 1.9405 2.8957 1.0561 1.0759 1.8254 1.1528 1.9702 1.7056 1.0549 10.6550 6.9707 7.8240 6.3341 7.7636 5.8921 1.0306 1.0310 1.0537 1.1043 1.1034 1.1187 1.0892 1.1026 1.1036 1.0891 1.0903 1.0908 1.0891 1.0960 1.0959 1.0919
irintensity: 14.0525 0.1219 0.7163 0.2071 0.1114 0.5998 7.1728 10.3141 2.3333 1.0459 0.4048 0.4328 0.2242 1.6217 7.1161 0.1719 16.9263 0.4220 3.2929 0.4794 0.1984 1.2292 18.7263 3.9298 5.7711 12.5213 14.4933 3.7804 55.4189 0.9668 13.1152 9.7260 12.9436 11.9253 1.2291 1.4709 6.4826 0.1364 6.9985 7.4242 18.1755 12.2595 92.3097 17.3582 3.2884 21.4233 6.3874 15.5533 5.0079 16.6334 80.3772 6.6982 179.8384 0.8038 50.2501 45.0594 47.7337 185.8919 4.7430 73.0177 28.6112 14.7842 0.2178 18.2454 5.2476 6.1957 12.4335 38.9344 115.6241 119.1380 567.2859 149.8211 92.8944 73.1482 125.0930 2.1100 173.2124 17.6188 25.6835 5.1041 105.4964 55.9578 21.4837 4.4207 110.2853 4.2872 191.4141 87.4578 21.3504 170.7736 7.9408 0.5663 128.1300 193.2205 197.4195 69.7998 93.3888 138.3743 26.8575 22.4965 30.3124 0.7049 21.9198 24.0039 5.0135 8.6522 5.8848 0.3584 9.6320 11.3588 3.2833
temp: 298.150 k
press: 1.00000 atm
elementType: 8 8 8 8 8 6 6 6 6 6 6 6 6 6 6 6 6 6 6 6 6 6 6 1 1 1 1 1 1 1 1 1 1 1 1 1 1 1 1
symmnumber: 1
zpe: 778205.4 jmol-1
zpe.correction: 0.296403 hartree
zpe.thermalcorrener: 0.317083 hartree
zpe.thermalcorrenthalpy: 0.318027 hartree
zpe.thermalcorrgfe: 0.244113 hartree
zpe.sumelectzpe: -1069.913165 hartree
zpe.sumelectthermal: -1069.892484 hartree
zpe.sumelectthermalent: -1069.891540 hartree
zpe.sumelectthermalfe: -1069.965454 hartree
dipole: 1.6207 4.2356 -0.1807
dipole: 4.5387
quadrupole: -103.8264 -130.5774 -133.7487
quadrupole: -6.0415 -1.9155 2.7559
quadrupole: 18.8911 -7.8599 -11.0312 -6.0415 -1.9155 2.7559
hfenergy: -1070.2095674 hartree
pointgroup: C01 [X(C18H16O5)]
dipole: -0.6131933 -1.6637702 -0.2109598 debye
polarizability: 453.5088954|-1.7463121|237.0890777|1.2672764|14.611822|103.6139363 unknown
InChI: InChI=1S/C18H16O5/c1-20-15-7-4-12(9-17(15)21-2)3-6-14(19)13-5-8-16-18(10-13)23-11-22-16/h3-10H,11H2,1-2H3
charge 0 multiplicity 1
39 atoms
O  4.525292 -2.360374 -0.442319
O  6.526688 -1.048738 -0.219866
O  -4.013889 -2.219494 -0.058387
O  -6.277455 -0.3526 0.005199
O  1.573676 2.991891 0.427168
C  4.205296 -0.996899 -0.213173
C  5.384973 -0.231506 -0.083114
C  2.86388 0.978297 0.126285
C  2.936368 -0.432104 -0.114256
C  5.343701 1.147293 0.153358
C  4.061691 1.736304 0.254087
C  6.009081 -2.421707 -0.48798
C  -2.263666 1.075874 0.211679
C  1.563197 1.724904 0.251227
C  -2.519354 -0.322062 0.101921
C  -0.914836 1.643697 0.265275
C  -3.830828 -0.819541 0.048953
C  0.281309 0.979233 0.171219
C  -3.38237 1.956963 0.287862
C  -4.940726 0.083504 0.064892
C  -4.699408 1.467693 0.210885
C  -4.67835 -2.837863 1.114716
C  -6.646475 -1.136128 -1.200901
H  2.049806 -1.059296 -0.224122
H  6.259017 1.735401 0.253756
H  3.954467 2.810155 0.434975
H  6.328909 -2.730966 -1.498189
H  6.368349 -3.098286 0.305386
H  -1.702586 -1.050335 0.073532
H  -0.844084 2.734314 0.393311
H  0.305239 -0.106437 0.035784
H  -3.207504 3.034073 0.389936
H  -5.561869 2.140372 0.24488
H  -5.669208 -2.382671 1.295679
H  -4.043496 -2.723011 2.01335
H  -4.783586 -3.903918 0.863011
H  -6.585253 -0.490344 -2.096527
H  -7.68771 -1.44963 -1.033703
H  -5.986485 -2.012458 -1.32309
