program: Gaussian 09
title: 000291418
version: EM64L-G09RevD.01
frameworkgroup: C1[X(C14H22O6)]
method: RPBEPBE
basis: SDD
operation: Freq
keyword: #pfreq=noraman
keyword: PBEPBE/SDD
title: #p freq=noraman PBEPBE/SDD
converged: YES YES NO NO
title: Mulliken charges:
elementType: O O O O O O C C C C C C C C C C C C C C H H H H H H H H H H H H H H H H H H H H H H
charge: -0.256080 -0.247013 -0.277083 -0.250582 -0.230590 -0.252553 -0.266531 -0.389721 -0.220311 0.216062 -0.688477 0.089828 0.187892 0.145859 -0.266107 -0.663684 -0.258386 -0.262797 -0.665009 -0.658604 0.315097 0.228950 0.230161 0.297994 0.225748 0.219416 0.226301 0.225362 0.233390 0.249104 0.232006 0.217367 0.235694 0.223698 0.232367 0.222992 0.218017 0.228667 0.249380 0.212565 0.242887 0.246720
chargesum: 0.00000
title: Mulliken charges with hydrogens summed into heavy atoms:
elementType: O O O O O O C C C C C C C C C C C C C C
charge: -0.256080 -0.247013 -0.277083 -0.250582 -0.230590 -0.252553 0.048566 0.069391 0.077683 0.216062 -0.017011 0.089828 0.187892 0.145859 0.192645 0.034792 0.201006 0.192563 0.031056 0.043569
polarizability: 2.17039755e+02 -9.26529451e-01 1.80210733e+02 -3.40360644e+00 3.71914123e+00 1.40587287e+02
1716.lowfreq: -6.6017 -4.3560 -0.0006 -0.0003 0.0002 5.1516 15.4964 23.4441 28.6717
frequency: 15.1461 23.2291 28.5843 39.2049 44.3731 47.1405 52.8058 70.5069 77.1150 83.3576 85.3077 97.1648 110.1424 146.0896 160.2151 174.3276 187.2032 209.9517 213.7374 218.7105 247.4729 276.1809 300.1366 304.9230 321.3392 336.1604 343.4024 368.4434 417.1473 432.6097 450.4964 478.4578 502.3498 576.7756 654.9404 677.0067 705.3023 711.9234 738.1264 759.0871 773.1820 801.2086 810.9658 816.3567 820.9296 825.2987 855.9573 863.9344 909.7991 956.8618 974.7054 1007.6090 1009.2713 1025.7946 1041.8325 1056.0653 1089.8513 1094.9012 1095.4644 1096.4896 1115.1172 1137.1290 1143.5191 1156.5206 1157.3451 1157.7527 1218.4762 1252.0839 1274.6120 1278.2765 1278.6506 1285.4547 1314.1834 1327.3293 1347.7877 1354.0936 1357.4348 1373.0466 1391.2760 1392.1861 1392.3579 1392.7098 1457.3637 1458.2720 1458.5402 1460.9801 1463.1807 1463.8970 1464.2382 1473.1434 1478.9178 1484.0568 1484.3380 1484.9782 1605.2425 1611.6814 1628.2581 1645.5392 2984.6734 2992.8108 2994.3817 2995.1140 2995.8777 3028.1918 3029.3363 3030.5468 3049.4548 3076.4111 3081.0313 3087.8564 3089.5535 3089.9921 3090.5645 3093.3949 3095.0321 3096.7690 3119.2615 3120.9770 3121.4684 3129.7275
redmass: 3.7454 3.9322 4.0690 3.4325 3.6373 4.1579 3.1295 2.8306 2.8167 5.4418 3.7588 3.7663 2.6858 3.6754 2.7381 2.3911 2.2330 1.5200 1.2711 1.3074 1.6149 3.8589 2.6243 3.4738 3.5568 3.2310 5.0273 4.0224 4.1694 3.5855 3.3267 5.0795 4.2908 5.2871 3.5592 7.2361 3.7899 5.0294 3.8041 1.8233 2.9454 1.6778 1.5683 1.5226 1.7081 2.7210 2.5494 2.6546 2.4098 1.5340 2.8487 2.6691 2.7495 4.1007 3.2912 2.4260 1.7415 2.1294 2.1805 2.1217 4.7090 2.7408 5.3586 1.6742 1.7071 1.7122 2.0857 1.2962 1.1283 1.1204 1.1152 1.4165 1.2572 1.4772 1.2614 1.2779 1.3981 1.6732 1.2312 1.2274 1.2268 1.2094 1.0977 1.0943 1.0840 1.0572 1.0439 1.0771 1.0442 1.0432 1.0568 1.0533 1.0519 1.0519 9.5899 9.6669 8.8772 8.3478 1.0354 1.0360 1.0363 1.0364 1.0594 1.0598 1.0597 1.0597 1.1010 1.0878 1.0994 1.0973 1.0974 1.1004 1.0986 1.1029 1.1032 1.1020 1.1061 1.1059 1.1054 1.0894
irintensity: 0.1210 0.2275 1.4135 0.4607 1.6085 2.1607 0.7522 0.0729 0.2728 3.5937 1.1723 0.3527 2.3332 0.5370 0.0880 2.6500 1.6654 2.4071 2.9348 1.2304 1.2195 1.1126 18.8399 10.1521 11.4254 1.0794 11.1597 1.5536 5.0197 3.9535 7.7582 5.6828 0.8047 19.3904 2.2495 7.4609 6.1017 2.5961 3.4989 15.1844 23.3090 1.8736 2.8314 7.0699 2.7399 8.7209 4.7641 6.5539 3.7590 36.5537 31.1611 18.9420 90.2839 249.2656 3.8629 115.9003 52.3648 43.8083 49.6319 5.0795 146.3806 194.9965 292.6476 25.2872 62.7444 9.6872 221.0448 17.5398 11.8336 5.4452 1.5689 36.8279 43.0821 43.4838 2.1634 7.7797 10.7959 6.4636 17.0289 16.5901 39.2304 5.4618 16.3877 23.6174 10.9520 11.1018 12.5066 8.1517 15.2907 12.1682 13.2461 14.7612 20.1245 8.6029 75.2818 93.1627 196.1091 206.0201 31.4237 18.0888 21.0894 19.6758 15.3745 31.5390 32.7610 31.0464 6.7624 9.9697 39.6926 40.3239 28.9896 39.0234 27.8716 1.0203 0.4634 7.9347 27.9034 30.1759 30.6037 6.0297
temp: 298.150 k
press: 1.00000 atm
elementType: 8 8 8 8 8 8 6 6 6 6 6 6 6 6 6 6 6 6 6 6 1 1 1 1 1 1 1 1 1 1 1 1 1 1 1 1 1 1 1 1 1 1
symmnumber: 1
zpe: 898547.8 jmol-1
zpe.correction: 0.342239 hartree
zpe.thermalcorrener: 0.366508 hartree
zpe.thermalcorrenthalpy: 0.367452 hartree
zpe.thermalcorrgfe: 0.283830 hartree
zpe.sumelectzpe: -996.455054 hartree
zpe.sumelectthermal: -996.430785 hartree
zpe.sumelectthermalent: -996.429841 hartree
zpe.sumelectthermalfe: -996.513463 hartree
dipole: -0.8675 -0.1349 0.7434
dipole: 1.1505
quadrupole: -104.1569 -108.1181 -118.9422
quadrupole: 0.0980 7.7055 -3.9359
quadrupole: 6.2488 2.2876 -8.5365 0.0980 7.7055 -3.9359
hfenergy: -996.7972926 hartree
pointgroup: C01 [X(C14H22O6)]
dipole: -0.3260301 0.2798257 0.1423694 debye
polarizability: 209.69522|-12.3105261|168.9486891|8.3293105|-23.4437001|159.1938658 unknown
InChI: InChI=1S/C14H22O6/c1-5-10(12(15)18-6-2)9-11(13(16)19-7-3)14(17)20-8-4/h9-10H,5-8H2,1-4H3
charge 0 multiplicity 1
42 atoms
O  -3.442535 -0.034038 -1.03577
O  -2.142626 1.896772 -1.202821
O  2.588987 1.123306 -0.213338
O  1.814069 -2.019124 2.07379
O  3.263045 -1.113042 -0.271714
O  -0.244326 -2.554595 1.117262
C  -1.506796 0.111001 0.388164
C  -1.800897 0.810485 1.770708
C  -0.044201 0.285855 0.049738
C  -2.359258 0.769851 -0.695588
C  -3.268507 0.66955 2.222435
C  0.983458 -0.542414 0.410378
C  2.383437 -0.250566 -0.038543
C  0.76358 -1.80622 1.190189
C  -4.37367 0.50064 -2.083185
C  -3.86796 0.144786 -3.483453
C  3.911208 1.523379 -0.786421
C  1.794511 -3.295029 2.855297
C  3.88122 1.46529 -2.316423
C  2.429687 -4.424079 2.039218
H  -1.775398 -0.953718 0.472686
H  -1.1317 0.345266 2.518441
H  -1.51884 1.877963 1.696727
H  0.210563 1.202166 -0.499103
H  -3.961353 1.178133 1.528552
H  -3.404138 1.118234 3.223293
H  -3.566751 -0.392785 2.277408
H  -5.331063 0.008506 -1.849643
H  -4.460042 1.593589 -1.951186
H  -2.915965 0.657983 -3.698868
H  -3.719164 -0.944063 -3.582881
H  -4.610065 0.463288 -4.238992
H  4.687274 0.855429 -0.373232
H  4.052057 2.549954 -0.412386
H  0.749918 -3.527006 3.128714
H  2.38147 -3.051294 3.754984
H  4.838793 1.841884 -2.721893
H  3.066511 2.091384 -2.719446
H  3.744352 0.428497 -2.666709
H  2.514874 -5.332198 2.664745
H  3.437875 -4.136786 1.696732
H  1.813468 -4.667838 1.157734
