program: Gaussian 09
title: 000291404
version: EM64L-G09RevD.01
frameworkgroup: C1[X(C19H20N2O)]
method: RPBEPBE
basis: SDD
operation: Freq
keyword: #p
keyword: freq=noraman
keyword: PBEPBE/SDD
title: #p freq=noraman PBEPBE/SDD
converged: YES YES NO NO
title: Mulliken charges:
elementType: O N N C C C C C C C C C C C C C C C C C C C H H H H H H H H H H H H H H H H H H H H
charge: -0.258628 -0.437545 -0.022569 -0.365341 -0.371454 -0.580653 -0.574245 0.526757 0.523018 -0.405410 -0.414367 -0.544843 -0.406592 0.474037 -0.450929 -0.357496 0.390254 -0.208283 -0.379807 0.209535 -0.268362 -0.800451 0.213440 0.208148 0.209770 0.214218 0.212065 0.206429 0.216828 0.211328 0.232097 0.233100 0.262511 0.241117 0.214011 0.306899 0.234384 0.259291 0.306572 0.236217 0.269310 0.235641
chargesum: 0.00000
title: Mulliken charges with hydrogens summed into heavy atoms:
elementType: O N N C C C C C C C C C C C C C C C C C C C
charge: -0.258628 -0.130973 -0.022569 0.056247 0.052533 -0.162160 -0.146090 0.526757 0.523018 -0.173314 -0.181268 -0.282332 -0.165475 0.474037 -0.236918 -0.050596 0.390254 0.026101 -0.120516 0.209535 -0.268362 -0.059283
polarizability: 3.39883004e+02 -8.43059167e+00 2.29447539e+02 -3.46249005e+01 4.56555652e+00 1.21020910e+02
1716.lowfreq: -75.5993 -4.5686 -0.0010 -0.0007 0.0003 3.9279 10.4533 14.5338 19.3840
frequency: -75.5988 10.2791 19.3101 24.1794 29.3898 55.8114 70.2947 83.9202 101.5065 109.0701 139.5816 145.7364 152.7491 171.4670 189.9845 282.1795 291.3538 299.4226 332.7578 356.0115 373.9227 383.0078 408.6104 410.5479 453.1158 478.3425 507.9134 541.9891 556.0327 572.0629 582.9232 624.9191 637.9034 638.5259 645.7995 701.8430 719.2298 736.4471 739.5953 780.9378 786.1332 815.5534 825.7633 835.0652 864.5648 890.2264 910.0882 923.4445 929.9266 933.9355 945.0059 985.4772 987.4806 990.1391 993.1865 1004.4814 1010.7960 1029.6097 1043.7137 1050.5620 1062.9794 1086.3394 1113.6036 1135.0584 1160.7565 1185.4066 1189.8802 1216.8115 1221.0812 1236.0296 1237.4619 1251.1198 1262.7642 1282.2635 1287.2039 1301.1861 1313.1882 1315.2614 1335.8549 1349.0745 1374.1839 1376.5198 1376.9968 1408.9098 1427.1633 1448.6381 1466.0281 1467.1152 1468.4347 1473.9911 1480.1865 1489.8036 1498.5485 1510.9026 1586.4181 1593.2872 1610.1018 1626.2907 1633.7695 2178.3956 2965.2252 2969.5294 2979.5508 2986.1272 2986.9130 3005.2046 3020.9976 3041.0378 3055.2940 3072.0829 3102.3055 3121.6804 3125.2751 3132.5718 3136.0604 3142.1165 3148.5814 3170.1312 3193.4400 3520.7421
redmass: 1.0566 5.5293 5.6116 4.7265 4.3597 4.7348 4.8914 4.4823 2.9354 1.7642 5.7829 5.0242 3.9919 4.7920 4.3321 4.3761 3.8945 3.7850 2.5984 3.7308 3.1589 4.3549 3.0114 4.1418 8.3728 3.8551 3.5779 3.0623 6.4839 4.6443 2.9657 5.6305 4.2970 1.2808 5.0438 2.1892 4.2683 3.5353 1.0915 1.5589 2.2581 1.5607 1.6994 3.1241 1.4962 1.7104 1.7968 2.0307 5.3681 1.4350 1.3888 1.6675 6.0542 1.3606 1.3723 3.6190 2.7519 1.6595 5.2059 1.6396 2.5838 1.4856 1.3690 1.2015 1.7352 1.0884 1.1249 3.7268 2.1436 1.3088 1.3576 3.1060 1.9937 1.2274 1.0666 1.4527 1.2789 1.4061 1.4166 1.5145 1.5017 7.6251 2.5848 3.5454 2.9043 1.1313 1.0865 1.1300 1.0471 2.1806 1.1160 1.1028 1.9402 2.8644 5.8160 5.3834 6.1457 6.0246 5.3325 12.6335 1.0594 1.0593 1.0596 1.0592 1.0383 1.0988 1.1021 1.1044 1.1048 1.0984 1.0876 1.0909 1.0885 1.0960 1.0979 1.0925 1.0915 1.0990 1.0944 1.0763
irintensity: 0.0036 0.1944 0.4242 0.3528 3.8640 0.1186 7.3261 0.7994 0.0846 0.8895 0.6386 2.2711 6.5460 0.7807 1.3310 0.2235 1.6081 0.4940 0.2359 1.9452 0.2053 0.1459 0.1427 0.9281 0.0561 10.5649 8.6070 28.3439 1.6614 5.5626 1.9278 1.2973 5.5214 58.0466 3.8793 24.0425 10.5813 1.7727 4.2060 5.0532 5.1148 25.8219 43.2773 3.7413 39.8608 1.6553 5.9968 7.3141 7.0467 9.5049 0.5723 20.7857 0.2694 3.1541 0.3786 0.2662 9.7073 7.9088 0.3263 2.5263 0.1085 6.2548 2.8527 16.9774 3.1576 0.3012 1.6615 45.8773 5.7277 12.8335 6.1287 7.0548 39.1889 0.4482 0.4385 0.6008 8.5344 53.8137 3.8518 0.6711 18.3489 1.1073 158.8630 45.0521 8.9989 50.6115 0.1405 1.3309 19.6644 16.4421 0.4429 18.7727 66.4315 391.6014 13.5682 42.4661 12.2458 33.8155 126.0092 35.7988 0.6030 4.4796 37.5678 88.7908 9.7637 0.3196 0.0110 2.7016 79.8771 16.2209 24.5735 22.2166 8.4622 15.4188 7.6711 6.5574 10.3934 11.5719 5.1643 11.0740
temp: 298.150 k
press: 1.00000 atm
elementType: 8 7 7 6 6 6 6 6 6 6 6 6 6 6 6 6 6 6 6 6 6 6 1 1 1 1 1 1 1 1 1 1 1 1 1 1 1 1 1 1 1 1
symmnumber: 1
zpe: 897364.9 jmol-1
zpe.correction: 0.341788 hartree
zpe.thermalcorrener: 0.362373 hartree
zpe.thermalcorrenthalpy: 0.363317 hartree
zpe.thermalcorrgfe: 0.287772 hartree
zpe.sumelectzpe: -919.188385 hartree
zpe.sumelectthermal: -919.167800 hartree
zpe.sumelectthermalent: -919.166856 hartree
zpe.sumelectthermalfe: -919.242401 hartree
dipole: 3.7157 -7.6379 -0.9481
dipole: 8.5465
quadrupole: -144.9654 -135.9806 -134.5529
quadrupole: 6.0087 -1.8219 0.1301
quadrupole: -6.4658 2.5190 3.9467 6.0087 -1.8219 0.1301
hfenergy: -919.530173 hartree
pointgroup: C01 [X(C19H20N2O1)]
dipole: 1.4820216 2.998618 0.343533 debye
polarizability: 339.6332529|8.0367574|229.4206034|35.7026432|3.0077472|121.2975966 unknown
InChI: InChI=1S/C19H20N2O/c1-15(22)21-19-11-9-16(10-12-19)5-2-3-6-17-7-4-8-18(13-17)14-20/h4,7-13,21H,2-3,5-6H2,1H3
charge 0 multiplicity 1
42 atoms
O  6.878508 -1.973083 0.435657
N  6.35008 0.309329 0.255216
N  -7.548238 -2.812293 -0.338175
C  -0.173122 0.398058 0.062448
C  -1.677909 0.454627 -0.278168
C  0.729855 0.407072 -1.203052
C  -2.576498 0.44293 0.991016
C  2.211223 0.364629 -0.860634
C  -4.057067 0.515388 0.653164
C  2.954445 1.557794 -0.670287
C  2.887331 -0.867364 -0.672555
C  -4.807225 -0.66307 0.429279
C  -4.709987 1.768241 0.509583
C  4.973556 0.275297 -0.114806
C  4.313549 1.519368 -0.303724
C  4.247618 -0.930831 -0.304988
C  -6.1799 -0.594766 0.06625
C  -6.074378 1.844214 0.149759
C  -6.818009 0.668184 -0.075167
C  7.218704 -0.756284 0.508241
C  -6.927856 -1.806228 -0.154252
C  8.634748 -0.315388 0.88638
H  0.044144 -0.513378 0.655207
H  0.097968 1.259121 0.706593
H  -1.89403 1.367996 -0.868906
H  -1.949152 -0.404842 -0.924059
H  0.460267 -0.461773 -1.835238
H  0.500777 1.315527 -1.794592
H  -2.360274 -0.476599 1.568799
H  -2.293313 1.299596 1.633223
H  2.465251 2.528865 -0.815684
H  2.339651 -1.806522 -0.821653
H  -4.331086 -1.643996 0.539362
H  -4.143337 2.690441 0.687092
H  4.867041 2.458304 -0.167618
H  4.755408 -1.886742 -0.16645
H  -6.560054 2.820471 0.048089
H  -7.875711 0.715062 -0.352123
H  6.751205 1.245778 0.34999
H  9.104014 0.271639 0.075019
H  9.242403 -1.213068 1.068678
H  8.632896 0.303798 1.802796
