program: Gaussian 09
title: 000291401
version: EM64L-G09RevD.01
frameworkgroup: C1[X(C18H21N3O3)]
method: RPBEPBE
basis: SDD
operation: Freq
keyword: #p
keyword: freq=noraman
keyword: PBEPBE/SDD
title: #p freq=noraman PBEPBE/SDD
converged: YES YES NO NO
title: Mulliken charges:
elementType: O O O N N N C C C C C C C C C C C C C C C C C C H H H H H H H H H H H H H H H H H H H H H
charge: -0.283997 -0.282606 -0.256381 -0.448128 -0.656528 -0.369348 -0.449600 -0.289884 -0.290910 0.411371 0.392952 -0.523591 0.524325 -0.523365 -0.384216 0.374340 -0.360057 -0.483233 -0.189327 -0.397628 -0.230634 0.067328 0.214475 -0.801382 0.215524 0.216890 0.236870 0.214456 0.214042 0.238126 0.325511 0.298393 0.252881 0.253848 0.217526 0.222691 0.220915 0.222805 0.309437 0.235363 0.268056 0.236445 0.315805 0.311621 0.208824
chargesum: 0.00000
title: Mulliken charges with hydrogens summed into heavy atoms:
elementType: O O O N N N C C C C C C C C C C C C C C C C C C
charge: -0.283997 -0.282606 -0.256381 -0.138691 -0.029102 -0.160524 -0.017187 0.161441 0.161257 0.411371 0.392952 -0.198081 0.524325 -0.224973 -0.131334 0.374340 -0.106209 -0.265707 0.033364 -0.176713 -0.007830 0.067328 0.214475 -0.061519
polarizability: 2.67240224e+02 -1.70259670e+01 2.22601116e+02 1.48479771e+01 -3.14353517e+01 2.14799436e+02
1716.lowfreq: -67.2492 -3.4910 -0.0004 -0.0003 0.0003 4.3654 8.4141 9.7002 17.3371
frequency: -67.2461 9.1161 17.3004 20.9676 40.7715 55.3154 66.1612 71.8594 82.2067 99.1514 118.9289 152.1089 170.8154 197.3040 219.4216 225.2764 233.9534 239.5230 261.1312 289.9166 322.1573 334.3371 354.9346 398.7734 416.7816 429.3863 434.4076 446.3583 455.7369 472.2047 496.3625 519.9793 551.7452 563.6546 567.7100 591.6338 610.9214 618.7594 642.0683 651.1500 675.5269 688.1454 705.6376 712.9760 743.2454 776.5124 786.8169 797.7498 815.4358 851.6038 856.5639 878.5379 896.7077 917.6133 924.4905 928.5813 930.6262 953.8760 962.9374 965.9832 972.3645 981.2254 986.4911 1010.1145 1030.5323 1040.6399 1047.4346 1074.1998 1089.6714 1100.5187 1102.8194 1117.7309 1124.4314 1152.3568 1186.2119 1188.3947 1199.6598 1202.1750 1226.1775 1234.3535 1266.9516 1284.7388 1287.5165 1290.7316 1355.0925 1367.4109 1373.9562 1374.7511 1377.1796 1397.2243 1399.2322 1431.2022 1434.9681 1446.6584 1452.8014 1469.2704 1474.7129 1476.9218 1480.4810 1480.9790 1515.2869 1576.7742 1594.4232 1601.8558 1620.8651 1624.5280 1634.2327 1635.9560 2969.0404 2970.3965 2986.3178 3010.2511 3036.1410 3043.5905 3071.3708 3074.3512 3117.4032 3126.9492 3134.8588 3146.4668 3147.9549 3170.9167 3175.2083 3176.4791 3201.2258 3322.3175 3525.8378 3533.8239 3679.6621
redmass: 1.0610 5.9959 5.5629 5.0019 5.4590 5.0178 5.9246 5.9755 4.7398 3.9747 3.8127 3.7445 3.7705 3.4137 3.1031 3.8972 4.9637 4.3958 4.0301 4.0391 3.5145 5.3721 2.6547 3.5937 2.4503 1.3749 2.6217 1.4067 3.0514 3.1718 3.3253 4.1530 3.2163 3.8671 3.1982 4.8802 5.0220 2.4904 1.4388 5.7523 3.1102 1.8345 3.9566 2.4768 4.1470 1.7032 1.7317 2.5646 1.3266 1.6356 3.0565 1.4708 2.2882 2.6594 1.4335 4.8040 1.5497 1.3330 1.5983 1.8912 2.9101 4.2299 4.7772 1.9140 1.6591 1.6468 2.0225 1.7460 1.7374 1.6520 1.6865 1.5942 2.3464 1.8898 1.2117 1.1134 1.1208 1.1425 3.4441 3.1329 2.1693 1.2984 1.4020 1.3049 1.3538 2.8958 1.7004 1.2385 1.5325 5.2901 4.8205 2.2558 1.1107 2.6043 1.2930 1.0471 2.7246 2.4268 1.1635 1.1782 2.0040 5.4061 5.8968 2.7182 5.9405 5.6157 1.6045 5.6042 1.0564 1.0572 1.0383 1.0642 1.1059 1.1041 1.0984 1.1018 1.0882 1.0861 1.0979 1.0926 1.0933 1.0957 1.0955 1.0923 1.0927 1.0761 1.0765 1.0450 1.1036
irintensity: 0.0499 0.2044 2.1020 2.5064 5.5082 15.0929 1.0021 1.0166 1.4189 1.5064 5.6932 5.2113 1.9960 3.6345 5.4947 5.3591 1.5429 7.7131 0.1246 1.4464 2.4625 0.9581 3.0750 16.3614 24.7813 127.6598 62.1720 64.5859 9.1418 5.6949 4.6397 14.5345 5.1036 19.9401 2.6246 7.9955 1.0383 9.6462 36.1455 1.9908 12.0701 47.0803 11.0813 36.1745 12.6621 76.7614 20.7859 2.0622 108.2723 1.1994 2.6396 0.1209 3.0543 2.5686 44.3931 12.5938 38.0467 3.3175 46.9917 48.2954 36.0878 6.3762 27.4579 70.6712 7.9849 11.1691 106.5720 72.9214 7.2971 4.1740 14.5429 39.1404 5.2099 157.1831 6.1187 6.4955 7.5413 13.8068 220.5089 185.2163 17.5202 29.4543 39.0948 8.7577 30.9893 142.0844 7.8995 48.8439 7.5513 3.5911 26.5127 205.7055 26.0114 173.0974 1.7524 19.4342 11.7005 21.5680 62.9576 26.4120 341.2089 95.6740 118.8304 118.4859 98.8501 114.9797 119.5911 136.6123 50.8231 15.4964 10.1504 14.8463 24.6129 59.9469 16.1621 27.9839 11.5879 5.6895 7.1069 24.9705 26.3499 9.9597 10.0610 5.9308 11.5153 33.9768 12.2001 16.6177 18.5627
temp: 298.150 k
press: 1.00000 atm
elementType: 8 8 8 7 7 7 6 6 6 6 6 6 6 6 6 6 6 6 6 6 6 6 6 6 1 1 1 1 1 1 1 1 1 1 1 1 1 1 1 1 1 1 1 1 1
symmnumber: 1
zpe: 948845.8 jmol-1
zpe.correction: 0.361396 hartree
zpe.thermalcorrener: 0.384140 hartree
zpe.thermalcorrenthalpy: 0.385085 hartree
zpe.thermalcorrgfe: 0.305367 hartree
zpe.sumelectzpe: -1086.681722 hartree
zpe.sumelectthermal: -1086.658978 hartree
zpe.sumelectthermalent: -1086.658033 hartree
zpe.sumelectthermalfe: -1086.737750 hartree
dipole: 0.4262 0.9568 1.4472
dipole: 1.7864
quadrupole: -87.2598 -131.2682 -135.0518
quadrupole: 9.9569 -16.5000 5.2094
quadrupole: 30.6001 -13.4082 -17.1919 9.9569 -16.5000 5.2094
hfenergy: -1087.0431179 hartree
pointgroup: C01 [X(C18H21N3O3)]
dipole: 0.1083314 0.6279192 0.2965727 debye
polarizability: 255.4492664|-2.9625316|191.18698|23.8776224|-16.9334775|258.0045297 unknown
InChI: InChI=1S/C18H21N3O3/c1-13(22)21-15-6-3-8-17(12-15)24-10-4-9-23-16-7-2-5-14(11-16)18(19)20/h2-3,5-8,11-12,19,21H,4,9-10,20H2,1H3
charge 0 multiplicity 1
45 atoms
O  -1.517197 -1.663296 -0.465504
O  2.139752 -1.60546 0.219041
O  -4.204467 1.105674 -3.276847
N  -5.206087 1.422859 -1.174662
N  6.707628 1.802617 2.294868
N  4.882545 0.899271 3.604606
C  0.399707 -3.115703 -0.477595
C  -0.696455 -2.523067 0.410606
C  1.392842 -2.061139 -0.97105
C  -2.581624 -0.954116 0.110314
C  3.091148 -0.587917 0.052771
C  -3.317881 -0.159043 -0.800997
C  -4.413627 0.595821 -0.32631
C  3.773377 -0.198891 1.227673
C  -2.921727 -1.009258 1.484813
C  4.758423 0.810483 1.179081
C  3.387641 0.031607 -1.188745
C  -4.768676 0.552797 1.05315
C  -4.021837 -0.245002 1.93758
C  5.050458 1.44641 -0.060072
C  4.364487 1.051842 -1.22697
C  5.46403 1.178081 2.453835
C  -5.087777 1.645398 -2.54978
C  -6.13654 2.61298 -3.104116
H  0.947647 -3.888875 0.092761
H  -0.069447 -3.604824 -1.351588
H  -0.251953 -1.919898 1.226007
H  -1.330459 -3.32219 0.844868
H  2.099061 -2.495577 -1.707207
H  0.856093 -1.209198 -1.431778
H  -3.038288 -0.133323 -1.854825
H  3.540674 -0.667981 2.187417
H  -2.353461 -1.618944 2.191695
H  2.868978 -0.257055 -2.107161
H  -5.618582 1.139374 1.423736
H  -4.294889 -0.274842 2.998088
H  5.764796 2.275451 -0.113637
H  4.580299 1.54859 -2.179439
H  -5.964608 1.922053 -0.703883
H  -7.162329 2.234988 -2.936274
H  -5.973525 2.722547 -4.185761
H  -6.054918 3.609138 -2.630544
H  7.169635 1.839523 1.389182
H  7.228855 2.116837 3.110594
H  5.457774 1.161153 4.432161
