program: Gaussian 09
title: 000291386
version: EM64L-G09RevD.01
frameworkgroup: C1[X(C20H14O4)]
method: RPBEPBE
basis: SDD
operation: Freq
keyword: #pfreq=noraman
keyword: PBEPBE/SDD
title: #p freq=noraman PBEPBE/SDD
converged: YES YES NO NO
title: Mulliken charges:
elementType: O O O O C C C C C C C C C C C C C C C C C C C C H H H H H H H H H H H H H H
charge: -0.278103 -0.277962 -0.249881 -0.249616 0.223370 0.223357 -0.337413 -0.337475 -0.331611 -0.331622 -0.218807 -0.218777 -0.216930 -0.216950 -0.220274 -0.220292 0.207638 0.207695 -0.403669 -0.404004 0.120853 0.120895 -0.067050 -0.066583 0.270471 0.270454 0.273086 0.273036 0.235062 0.235054 0.233045 0.233036 0.233784 0.233785 0.272010 0.254417 0.271686 0.254288
chargesum: 0.00000
title: Mulliken charges with hydrogens summed into heavy atoms:
elementType: O O O O C C C C C C C C C C C C C C C C C C C C
charge: -0.278103 -0.277962 -0.249881 -0.249616 0.223370 0.223357 -0.066941 -0.067021 -0.058525 -0.058587 0.016254 0.016276 0.016115 0.016086 0.013510 0.013493 0.207638 0.207695 0.122758 0.121970 0.120853 0.120895 -0.067050 -0.066583
polarizability: 3.67641012e+02 3.44134475e-01 2.31634024e+02 -1.80683281e+01 3.56394721e-01 1.55389317e+02
1716.lowfreq: -0.0006 -0.0004 0.0006 2.2300 2.9539 6.6822 7.7321 14.0706 15.1483
frequency: 7.6647 13.9589 15.1040 17.6422 24.4254 54.9243 57.6430 79.4220 80.4350 132.1558 149.7115 151.0704 174.4020 197.3646 205.0292 249.1737 304.4017 312.9528 315.6900 332.7861 334.3075 403.3720 403.4346 416.8508 428.0730 441.1114 446.7660 490.9984 493.7318 512.0238 559.4343 613.9805 614.0042 649.5757 654.2191 660.5644 678.9565 683.1187 700.9593 701.2124 758.2923 759.3952 796.1486 796.1655 863.2501 865.2330 865.2995 874.3351 956.5511 956.5884 969.8330 987.5149 989.9702 990.8272 991.0899 997.0788 997.0918 1009.8678 1009.8896 1010.2108 1014.9544 1036.1298 1039.0069 1085.9421 1086.4172 1174.8695 1174.8769 1182.2288 1183.2341 1229.3626 1233.6412 1233.8563 1238.4001 1289.7761 1316.2725 1316.3464 1335.9317 1351.8471 1390.5966 1390.6120 1435.1277 1436.3289 1438.6643 1438.6859 1478.2274 1478.2671 1586.1294 1586.1485 1611.4658 1611.5316 1629.3343 1629.4419 2184.6082 2296.8142 3002.2376 3002.8810 3073.7843 3074.4804 3131.5575 3131.5922 3144.3923 3144.4821 3156.6659 3156.7390 3168.4687 3168.5433 3180.7865 3180.8896
redmass: 6.0724 5.6055 6.1567 5.8369 6.0363 5.5996 5.9079 8.5374 7.5595 6.5032 4.1787 6.2921 3.5944 6.4154 5.0417 8.5705 4.6879 4.1124 3.3438 6.0786 6.9716 2.8229 2.8232 7.1756 5.7332 3.8312 4.7434 8.2167 9.2800 7.8198 9.2577 6.4375 6.4373 6.2413 6.2753 5.7737 5.1622 5.4083 1.6062 1.6154 5.6456 5.6228 2.1559 2.1552 9.1946 1.2452 1.2447 9.2435 1.4208 1.4206 3.7453 2.3115 3.9149 5.0940 3.4305 1.3876 1.3872 1.3575 1.3355 3.8903 3.7968 2.1978 2.3803 1.5970 1.6163 1.0568 1.0567 1.1345 1.1264 1.1700 1.5021 1.7634 2.9613 2.6145 1.3167 1.3163 1.3185 1.8702 10.0431 10.0429 1.1089 1.1208 2.2007 2.2104 2.2790 2.2809 6.5588 6.5622 6.0738 6.0767 10.3806 10.4149 11.7856 11.8806 1.0585 1.0585 1.1022 1.1023 1.0856 1.0856 1.0892 1.0892 1.0940 1.0940 1.0982 1.0981 1.0976 1.0976
irintensity: 0.0030 0.5610 0.0014 0.1541 1.5132 0.0101 2.2704 0.9323 0.8012 0.4729 1.8421 0.6805 3.9831 0.4618 5.4180 0.1119 5.8208 70.6392 0.0230 0.9504 2.3592 0.0131 0.0089 0.0184 4.4810 0.0229 0.2721 7.8166 2.4761 4.0543 12.9775 2.1529 0.1268 0.6239 0.3710 3.9602 29.3688 2.0122 182.8294 2.8096 23.8726 3.3017 2.8672 49.6220 161.2405 0.0354 0.0001 33.5539 7.0211 1.3645 196.2921 3.2030 18.6046 0.0313 2.7812 0.2805 0.0090 22.1001 4.0219 620.7258 37.2052 268.0004 3.1668 13.5602 16.9322 0.1124 0.1872 103.9382 16.9488 99.5367 213.3252 307.7911 59.3204 12.7752 3.4102 1.1444 46.2572 30.2531 1.3665 5.0810 33.1754 36.5167 25.7240 6.4970 3.0251 7.6847 13.4013 38.0563 21.2959 10.1457 86.3902 270.6950 20.3834 0.0145 35.6247 26.1900 9.8226 5.4000 0.3376 0.3561 10.9757 10.6149 13.4625 17.4879 28.2142 15.5768 7.1892 8.1427
temp: 298.150 k
press: 1.00000 atm
elementType: 8 8 8 8 6 6 6 6 6 6 6 6 6 6 6 6 6 6 6 6 6 6 6 6 1 1 1 1 1 1 1 1 1 1 1 1 1 1
symmnumber: 1
zpe: 736121.2 jmol-1
zpe.correction: 0.280374 hartree
zpe.thermalcorrener: 0.302294 hartree
zpe.thermalcorrenthalpy: 0.303238 hartree
zpe.thermalcorrgfe: 0.222003 hartree
zpe.sumelectzpe: -1069.660497 hartree
zpe.sumelectthermal: -1069.638577 hartree
zpe.sumelectthermalent: -1069.637633 hartree
zpe.sumelectthermalfe: -1069.718868 hartree
dipole: 0.0162 3.9818 0.0145
dipole: 3.9819
quadrupole: -111.4502 -130.8526 -129.0827
quadrupole: -0.0277 -4.5008 0.0017
quadrupole: 12.3450 -7.0575 -5.2875 -0.0277 -4.5008 0.0017
hfenergy: -1069.9408707 hartree
pointgroup: C01 [X(C20H14O4)]
dipole: -0.0011388 1.566357 0.0267617 debye
polarizability: 368.5649461|-0.535735|231.617781|-11.3613126|1.2792762|154.4816263 unknown
InChI: InChI=1S/C20H14O4/c21-19(17-11-5-3-6-12-17)23-15-9-1-2-10-16-24-20(22)18-13-7-4-8-14-18/h3-8,11-14H,15-16H2
charge 0 multiplicity 1
38 atoms
O  3.763623 -0.598069 1.437624
O  -3.773939 -0.51133 -1.478734
O  5.081048 -2.164386 0.302877
O  -5.080238 -2.11527 -0.384613
C  5.706664 0.196629 0.274249
C  -5.703409 0.243743 -0.267394
C  6.882154 -0.043323 -0.485054
C  -6.871124 -0.021379 0.495573
C  5.366037 1.52028 0.657664
C  -5.365824 1.579518 -0.609187
C  7.711958 1.03363 -0.856582
C  -7.696345 1.042693 0.911716
C  6.200432 2.594068 0.28253
C  -6.195572 2.640296 -0.189517
C  7.372703 2.353647 -0.473336
C  -7.360251 2.374802 0.569708
C  4.862723 -0.975305 0.637972
C  -4.86452 -0.915401 -0.680524
C  2.822215 -1.702952 1.812546
C  -2.838527 -1.603465 -1.902656
C  1.608857 -1.665588 1.000968
C  -1.623906 -1.608991 -1.091982
C  0.566228 -1.644543 0.328298
C  -0.58063 -1.6242 -0.42016
H  7.122207 -1.072577 -0.771368
H  -7.109011 -1.05967 0.749242
H  4.45593 1.691491 1.238704
H  -4.461617 1.769956 -1.193417
H  8.618617 0.848301 -1.442304
H  -8.597048 0.837984 1.500178
H  5.938637 3.616147 0.576477
H  -5.936128 3.671654 -0.451399
H  8.018056 3.190478 -0.76327
H  -8.00211 3.201496 0.894391
H  3.350086 -2.667888 1.68847
H  2.597335 -1.527785 2.878483
H  -3.370925 -2.570331 -1.820583
H  -2.614083 -1.381959 -2.95999
