program: Gaussian 09
title: 000291379
version: EM64L-G09RevD.01
frameworkgroup: C1[X(C19H19NO)]
method: RPBEPBE
basis: SDD
operation: Freq
keyword: #p
keyword: freq=noraman
keyword: PBEPBE/SDD
title: #p freq=noraman PBEPBE/SDD
converged: YES YES NO NO
title: Mulliken charges:
elementType: O N C C C C C C C C C C C C C C C C C C C H H H H H H H H H H H H H H H H H H H
charge: -0.268870 -0.147618 0.400628 0.530171 -0.356175 -0.368208 -0.410893 -0.422254 -0.646487 -0.645176 -0.328602 -0.231364 0.292457 0.095824 -0.157938 -0.344784 -0.357649 -0.337532 -0.251205 -0.234404 -0.232724 0.237818 0.239462 0.223622 0.228879 0.238549 0.220270 0.238503 0.219826 0.238796 0.238951 0.229686 0.218420 0.262142 0.219271 0.279990 0.207252 0.224893 0.228210 0.228267
chargesum: 0.00000
title: Mulliken charges with hydrogens summed into heavy atoms:
elementType: O N C C C C C C C C C C C C C C C C C C C
charge: -0.268870 -0.147618 0.400628 0.530171 -0.118358 -0.128746 -0.187271 -0.193375 0.050835 0.052396 -0.098916 -0.012944 0.292457 0.095824 0.104204 -0.125512 -0.077659 -0.130281 -0.026313 -0.006195 -0.004457
polarizability: 7.18938551e+02 -5.45538990e+00 2.13766911e+02 1.60780295e+00 -8.39654423e-01 9.36672929e+01
1716.lowfreq: -0.0013 -0.0002 0.0010 3.0213 4.5066 10.1256 17.8507 23.5109 30.5607
frequency: 15.7919 22.7734 30.4400 42.7000 70.3312 81.6281 102.5484 109.5832 127.2011 152.1314 167.0843 200.3615 208.5668 213.5149 256.7842 268.8297 290.8601 337.6882 342.8018 399.9804 405.7818 417.7221 429.5929 446.7097 460.8807 480.2922 519.5204 524.8976 562.5489 614.2665 634.9965 661.2036 677.4816 696.1881 718.9900 739.2818 787.8829 804.5640 820.9212 825.2232 842.4184 849.5578 859.1033 901.1837 937.1130 941.4148 942.1660 957.6616 962.1107 987.2975 989.2386 994.6840 1010.3776 1017.4296 1021.6643 1037.6361 1056.9894 1084.6398 1105.9578 1111.2154 1130.8942 1166.5377 1169.8837 1178.2245 1186.2318 1202.2557 1208.9534 1248.5976 1257.7023 1260.8614 1283.3537 1300.2146 1316.5688 1333.8395 1354.7484 1369.7927 1384.3494 1386.9736 1430.8534 1431.1635 1453.1202 1460.3292 1465.2289 1477.4932 1478.3071 1493.0136 1500.3788 1507.4202 1530.0401 1547.8389 1585.2475 1603.2322 1606.9746 1612.1610 1642.2015 2946.7443 2953.5772 3014.7489 3017.3064 3080.9938 3089.9453 3102.1084 3102.8153 3111.2825 3120.8245 3123.5660 3132.7213 3134.2593 3137.7143 3149.8102 3158.6894 3164.3923 3167.5991 3168.3815
redmass: 3.6497 3.8813 5.1113 5.9547 3.0311 2.9499 5.2168 2.7586 1.6325 6.5598 3.2347 1.1454 3.2962 2.3335 2.8564 4.3137 2.7838 5.2061 4.8175 2.8462 3.2481 4.9260 3.1149 3.4892 3.9065 4.0531 3.9895 2.1616 4.1603 6.4166 7.0909 6.2748 3.5985 1.5546 4.6716 3.1753 1.8380 1.2758 1.7774 5.3044 5.4408 1.5957 1.4567 1.8476 1.3467 1.4105 3.0909 1.3584 1.3709 1.3877 5.8434 2.9109 1.3420 3.2558 1.1469 2.0983 1.5034 1.6488 1.2378 1.3248 1.6450 1.7134 1.1392 1.9345 1.1765 1.2156 1.2440 1.8535 2.8063 1.9530 1.7353 1.4246 1.5631 1.3817 2.0884 3.2532 8.4987 3.3092 1.8455 1.4220 2.6870 1.2706 1.0399 1.0464 2.2752 1.1187 3.7067 1.3629 2.5569 5.9278 5.9448 5.3945 5.6884 5.4625 6.0122 1.0368 1.0392 1.0993 1.1030 1.0905 1.0905 1.0961 1.0882 1.0944 1.0893 1.0848 1.0890 1.0877 1.0896 1.0923 1.0945 1.0932 1.1001 1.0945
irintensity: 0.1568 0.8518 0.4391 0.3069 0.9973 1.5461 0.3030 3.6930 0.9200 0.1960 0.6997 0.0124 1.3742 0.4255 1.3275 8.2796 4.1725 23.9701 2.1840 0.0893 0.3427 2.6957 0.1613 2.5201 12.5004 2.9810 7.3489 17.7878 2.8909 1.1110 0.1383 36.0081 17.2891 68.1805 11.9940 2.9412 25.0676 1.3889 77.3684 14.4860 16.7552 15.4770 4.1683 4.3739 11.3654 1.5061 48.5149 0.4620 1.6879 2.0038 2.4078 1.3612 0.4346 114.8020 87.7857 74.4143 25.5999 14.6255 0.0138 1.0758 8.2040 71.4889 40.3427 275.3739 14.7267 56.3081 55.3324 114.8456 26.4778 84.8034 123.9989 19.7223 166.1378 36.9378 265.3012 544.5886 1.8842 52.5017 1.8808 4.9754 19.1654 24.8038 0.0917 23.3900 4.8375 1.3676 863.0491 17.2578 211.9052 5.6043 355.8899 473.8240 222.9752 680.7581 32.1524 93.3476 229.0795 0.0334 80.6720 5.6759 4.4304 2.9542 21.2355 51.3272 10.9410 1.7722 17.0404 6.2874 0.9916 32.8835 33.8976 26.1020 41.7458 20.6803
temp: 298.150 k
press: 1.00000 atm
elementType: 8 7 6 6 6 6 6 6 6 6 6 6 6 6 6 6 6 6 6 6 6 1 1 1 1 1 1 1 1 1 1 1 1 1 1 1 1 1 1 1
symmnumber: 1
zpe: 853672.3 jmol-1
zpe.correction: 0.325147 hartree
zpe.thermalcorrener: 0.345082 hartree
zpe.thermalcorrenthalpy: 0.346026 hartree
zpe.thermalcorrgfe: 0.273628 hartree
zpe.sumelectzpe: -863.882114 hartree
zpe.sumelectthermal: -863.862179 hartree
zpe.sumelectthermalent: -863.861235 hartree
zpe.sumelectthermalfe: -863.933633 hartree
dipole: -8.2630 4.0083 0.0334
dipole: 9.1839
quadrupole: -69.1425 -115.6817 -133.4773
quadrupole: 8.8179 0.2362 -0.0932
quadrupole: 36.9580 -9.5812 -27.3768 8.8179 0.2362 -0.0932
hfenergy: -864.2072608 hartree
pointgroup: C01 [X(C19H19N1O1)]
dipole: 3.24046 -1.5961746 -0.083854 debye
polarizability: 718.8442551|-8.8597771|213.1159584|1.3424012|9.4551291|94.4125413 unknown
InChI: InChI=1S/C19H19NO/c1-20(2)18-14-12-16(13-15-18)8-6-7-11-19(21)17-9-4-3-5-10-17/h3-15H,1-2H3
charge 0 multiplicity 1
40 atoms
O  -3.714655 2.101341 0.14521
N  6.798896 -0.679995 0.018127
C  5.462742 -0.281852 0.030187
C  2.684902 0.535034 0.053828
C  4.398434 -1.245898 -0.013159
C  5.096793 1.103371 0.085915
C  3.058149 -0.843576 -0.001528
C  3.748986 1.486204 0.096661
C  7.145894 -2.107491 -0.033864
C  7.867869 0.327528 0.06598
C  1.30584 1.001705 0.069014
C  0.150684 0.239879 0.033428
C  -4.931509 0.024624 -0.009952
C  -3.650873 0.824225 0.054802
C  -1.164165 0.826258 0.054893
C  -4.977703 -1.382915 -0.20559
C  -6.156018 0.734492 0.125205
C  -2.353325 0.123907 0.018708
C  -6.21595 -2.059505 -0.263431
C  -7.391475 0.060525 0.070988
C  -7.426361 -1.341849 -0.123746
H  4.627657 -2.314229 -0.056558
H  5.867596 1.877993 0.120944
H  2.281096 -1.615396 -0.03585
H  3.50133 2.554452 0.140009
H  6.748968 -2.65884 0.842159
H  8.241299 -2.217698 -0.035088
H  6.753936 -2.592074 -0.950603
H  8.846883 -0.175499 0.043816
H  7.817606 0.935744 0.991561
H  7.819548 1.017367 -0.800383
H  1.176074 2.094268 0.114501
H  0.214498 -0.856633 -0.0127
H  -1.243662 1.923125 0.104991
H  -4.055801 -1.961047 -0.322872
H  -6.099061 1.818506 0.269884
H  -2.330199 -0.970484 -0.028097
H  -6.237389 -3.14414 -0.418353
H  -8.326375 0.621788 0.179047
H  -8.386257 -1.869015 -0.167682
