program: Gaussian 09
title: 000291377
version: EM64L-G09RevD.01
frameworkgroup: C1[X(C21H24N2O)]
method: RPBEPBE
basis: SDD
operation: Freq
keyword: #p
keyword: freq=noraman
keyword: PBEPBE/SDD
title: #p freq=noraman PBEPBE/SDD
converged: YES YES NO NO
title: Mulliken charges:
elementType: O N N C C C C C C C C C C C C C C C C C C C C C H H H H H H H H H H H H H H H H H H H H H H H H
charge: -0.283503 -0.148605 -0.148594 0.399644 0.399648 0.522563 0.522560 -0.359184 -0.359181 -0.371277 -0.371280 -0.405075 -0.405082 -0.423850 -0.423844 -0.647423 -0.645765 -0.647437 -0.645757 -0.302859 -0.302858 -0.335808 -0.335807 0.149829 0.235166 0.235168 0.237109 0.237107 0.224565 0.224566 0.233295 0.233295 0.236689 0.218083 0.236741 0.237466 0.237639 0.217356 0.218083 0.236805 0.236622 0.237521 0.217355 0.237581 0.269139 0.269138 0.201229 0.201228
chargesum: 0.00000
title: Mulliken charges with hydrogens summed into heavy atoms:
elementType: O N N C C C C C C C C C C C C C C C C C C C C C
charge: -0.283503 -0.148605 -0.148594 0.399644 0.399648 0.522563 0.522560 -0.124018 -0.124013 -0.134169 -0.134173 -0.180511 -0.180517 -0.190555 -0.190549 0.044091 0.046696 0.044072 0.046701 -0.033720 -0.033719 -0.134579 -0.134578 0.149829
polarizability: 8.40353574e+02 -3.52545742e-04 2.54159783e+02 -2.47511261e-02 -8.49948840e-02 1.16210574e+02
1716.lowfreq: -2.7082 -0.0022 0.0008 0.0016 2.6314 8.6479 20.4717 22.3426 24.9595
frequency: 20.1851 22.3419 24.9480 43.2964 62.1016 74.5898 76.6351 77.4126 97.0665 106.3098 109.3775 144.2411 144.6447 162.7511 169.3458 197.4510 197.8924 219.1694 224.5949 250.6960 256.3501 258.8827 277.7956 350.5786 382.4920 383.8306 391.7694 424.3404 424.3946 428.3842 461.9556 481.0154 515.8080 522.5840 523.8959 524.2773 538.4561 633.8957 636.1370 661.2534 675.1108 711.9745 737.5859 749.3909 751.2776 806.2664 806.8736 818.2027 825.5809 830.6214 857.7833 860.1969 901.3977 942.2220 942.7293 948.2310 948.8432 959.2019 959.6189 962.8654 994.7428 995.0685 1006.6246 1014.8736 1056.7814 1056.8284 1107.5533 1107.5665 1110.6133 1111.1762 1111.1859 1130.5103 1131.0062 1166.1686 1167.0636 1195.8615 1199.1887 1228.8991 1229.8367 1259.7184 1259.7507 1285.1045 1290.9444 1310.0700 1328.0033 1332.4139 1342.4477 1367.5113 1368.7857 1379.7898 1384.0589 1430.5238 1430.5356 1448.8063 1448.9051 1459.3596 1459.4558 1464.8811 1464.8842 1476.4498 1476.4539 1492.3728 1492.3937 1503.3042 1505.5028 1505.7440 1528.8210 1530.7188 1550.2288 1550.4908 1602.1163 1629.9529 1636.4933 1641.4242 2942.3478 2942.3983 2949.5466 2950.1890 3009.0262 3009.0854 3011.9868 3012.0372 3086.1576 3086.9769 3096.7880 3096.7922 3102.5811 3107.0963 3107.1308 3111.8194 3123.4423 3123.4936 3132.4701 3132.6913 3163.5370 3163.5829 3168.1111 3168.2583
redmass: 3.7855 4.9726 3.0744 4.6339 5.6925 2.4149 2.2833 4.9140 3.6478 1.9868 1.6979 2.0382 5.6364 2.0287 4.6030 1.1272 1.1323 4.5877 2.5581 5.3737 2.1680 2.3905 3.8137 4.0777 3.4739 3.9149 3.4230 2.9381 2.9184 3.8983 3.8765 3.4255 2.2607 2.2308 3.6832 4.1367 4.0433 7.0609 6.9758 5.6310 3.4142 4.7413 3.1631 5.5322 3.9037 1.2736 1.2649 1.7138 1.8149 5.6031 4.1127 1.7366 2.0328 3.1140 3.1095 1.3623 1.3732 1.3504 1.3511 4.5774 2.9412 2.9022 1.2250 1.2131 1.4983 1.4986 1.2382 1.2381 2.2517 1.3249 1.3243 1.6205 1.5211 1.6958 1.6800 1.1654 1.1717 1.3885 1.2862 2.8623 2.8621 1.5610 2.4133 1.3977 1.4816 1.3703 2.2911 3.2207 4.0248 4.4539 4.2483 1.2765 1.2779 2.5624 2.5739 1.2550 1.2503 1.0398 1.0398 1.0456 1.0456 1.1050 1.1088 3.9686 1.1180 1.3446 2.6560 2.6313 6.1194 6.1701 5.2599 5.9593 6.1167 5.7129 1.0367 1.0367 1.0392 1.0393 1.0995 1.0995 1.1027 1.1027 1.0893 1.0895 1.0964 1.0964 1.0896 1.0943 1.0943 1.0894 1.0894 1.0893 1.0877 1.0876 1.0935 1.0935 1.0939 1.0939
irintensity: 1.1716 1.6122 0.0011 0.0000 0.0258 0.3817 0.0000 0.0708 3.4163 0.0003 9.2834 0.0046 0.2021 2.3270 0.0128 0.0001 0.0765 1.9581 0.0005 0.0144 0.0010 3.4515 0.5439 18.8130 6.5288 0.0002 0.0357 0.0001 0.6233 0.0044 8.9962 6.3675 36.7259 0.0017 0.0052 72.3626 0.9799 0.2744 0.0070 37.2300 3.5562 0.0089 0.0001 4.5538 1.6661 0.0003 0.0506 0.0004 166.4184 0.5308 2.2639 0.0001 24.0579 68.6838 6.6910 0.0000 3.3263 0.0002 0.3670 0.3020 1.2027 0.0342 0.0020 80.3606 9.3290 42.9186 0.0116 0.0164 830.4723 2.6944 2.2832 43.1346 7.9523 1.4444 0.3426 395.6651 11.1030 1.7889 0.5444 12.2691 41.9532 103.9677 0.0891 2.8892 3.3138 11.2984 353.7199 45.8889 483.8153 16.0223 46.5179 10.6042 31.6189 93.5514 3.6295 90.0785 8.9298 0.0186 0.0232 4.2939 40.3001 18.3307 10.3998 227.6405 112.5121 13.0596 1095.0099 40.2187 28.1838 8.9568 2561.0802 66.4900 105.4224 9.9252 39.5467 153.6005 443.5422 20.7752 5.8066 6.3391 53.2213 105.7871 0.2069 1.0352 2.2081 6.4067 11.5406 95.2705 14.2597 26.6159 0.8733 20.4347 10.8886 2.3113 1.0903 49.1416 60.3339 0.0247
temp: 298.150 k
press: 1.00000 atm
elementType: 8 7 7 6 6 6 6 6 6 6 6 6 6 6 6 6 6 6 6 6 6 6 6 6 1 1 1 1 1 1 1 1 1 1 1 1 1 1 1 1 1 1 1 1 1 1 1 1
symmnumber: 1
zpe: 1041089.9 jmol-1
zpe.correction: 0.396530 hartree
zpe.thermalcorrener: 0.421037 hartree
zpe.thermalcorrenthalpy: 0.421981 hartree
zpe.thermalcorrgfe: 0.339547 hartree
zpe.sumelectzpe: -997.587491 hartree
zpe.sumelectthermal: -997.562984 hartree
zpe.sumelectthermalent: -997.562040 hartree
zpe.sumelectthermalfe: -997.644474 hartree
dipole: -0.0001 6.3323 0.0063
dipole: 6.3323
quadrupole: -21.0590 -136.4493 -153.0391
quadrupole: -0.0003 0.0179 -0.0516
quadrupole: 82.4568 -32.9335 -49.5233 -0.0003 0.0179 -0.0516
hfenergy: -997.9840208 hartree
pointgroup: C01 [X(C21H24N2O1)]
dipole: 0.0021348 2.4904795 -0.0642278 debye
polarizability: 840.3525339|-0.4751904|254.079648|0.6861859|-3.3334863|116.2917481 unknown
InChI: InChI=1S/C21H24N2O/c1-22(2)19-11-5-17(6-12-19)9-15-21(24)16-10-18-7-13-20(14-8-18)23(3)4/h5-16H,1-4H3
charge 0 multiplicity 1
48 atoms
O  -0.001398 -2.604591 0.095042
N  7.760242 1.138684 0.004395
N  -7.756718 1.151379 -0.009231
C  6.47573 0.592069 0.018738
C  -6.473137 0.602618 0.006294
C  3.807557 -0.531751 0.047504
C  -3.806858 -0.525548 0.039677
C  5.310437 1.431231 0.001896
C  -5.30644 1.439783 -0.012561
C  6.267776 -0.825271 0.05093
C  -6.267568 -0.814986 0.041855
C  4.023621 0.879267 0.015859
C  -4.020551 0.885731 0.003876
C  4.970369 -1.357933 0.064593
C  -4.971054 -1.34976 0.057804
C  7.942653 2.595846 -0.02513
C  8.935304 0.257293 0.023221
C  -7.936615 2.608715 -0.04411
C  -8.933291 0.271972 0.007735
C  2.48675 -1.151242 0.062064
C  -2.487096 -1.147183 0.057267
C  1.258143 -0.535339 0.048817
C  -1.257462 -0.533298 0.045827
C  -0.000319 -1.320335 0.065648
H  5.417486 2.519416 -0.022029
H  -5.411662 2.528052 -0.040488
H  7.120835 -1.508997 0.065424
H  -7.121771 -1.49727 0.056969
H  3.162498 1.557078 0.002005
H  -3.158301 1.562066 -0.01189
H  4.842116 -2.447389 0.089143
H  -4.844624 -2.439367 0.084964
H  7.493328 3.08546 0.862666
H  9.018623 2.830319 -0.031698
H  7.49062 3.04923 -0.930514
H  8.961817 -0.373304 0.935097
H  8.957502 -0.415926 -0.857611
H  9.8518 0.867598 0.006372
H  -9.012179 2.845092 -0.049008
H  -7.484642 3.100513 0.841015
H  -7.485584 3.058265 -0.952029
H  -8.961159 -0.3593 0.919016
H  -9.848731 0.883862 -0.008906
H  -8.956363 -0.400535 -0.873717
H  2.456373 -2.25161 0.08609
H  -2.458571 -2.247572 0.082586
H  1.165005 0.558796 0.024788
H  -1.162493 0.560672 0.021342
