program: Gaussian 09
title: 000291366
version: EM64L-G09RevD.01
frameworkgroup: C1[X(C15H15NOS2)]
method: RPBEPBE
basis: SDD
operation: Freq
keyword: #p
keyword: freq=noraman
keyword: PBEPBE/SDD
title: #p freq=noraman PBEPBE/SDD
converged: YES YES NO NO
title: Mulliken charges:
elementType: S S O N C C C C C C C C C C C C C C C H H H H H H H H H H H H H H H
charge: 0.209384 0.211450 -0.427050 -0.102184 0.337658 0.337392 -0.022133 -0.403391 -0.340555 -0.381683 -0.406447 -0.226892 -0.223964 -0.164932 -0.239731 -0.224894 -0.166188 -0.864391 -0.864347 0.258284 0.263295 0.263461 0.260365 0.237911 0.241366 0.240936 0.238576 0.264373 0.267238 0.262623 0.267840 0.262989 0.264228 0.369414
chargesum: 0.00000
title: Mulliken charges with hydrogens summed into heavy atoms:
elementType: S S O N C C C C C C C C C C C C C C C
charge: 0.209384 0.211450 -0.057636 -0.102184 0.337658 0.337392 -0.022133 -0.145106 -0.077260 -0.118222 -0.146082 -0.226892 -0.223964 0.072979 0.001635 0.016042 0.072388 -0.070156 -0.069290
polarizability: 3.36161387e+02 3.78155301e+00 2.43416324e+02 -1.57766989e+01 3.63294190e-02 1.22725169e+02
1716.lowfreq: -4.6773 -2.0311 -0.0014 0.0008 0.0011 2.7488 26.5302 32.4322 41.6921
frequency: 26.4605 32.2878 41.6547 44.8908 66.0884 73.5400 110.8394 128.1809 178.7696 181.8026 189.3134 208.0827 222.1798 226.7193 249.2912 300.9953 314.3983 320.4948 359.3193 367.5049 402.7483 410.6112 425.8402 441.3793 469.2300 493.9823 510.7411 586.4940 620.2109 630.5346 653.4034 669.1201 672.9156 696.3746 725.2850 735.9292 742.8290 826.9859 828.8117 836.0676 839.6200 871.9397 943.6065 959.5142 963.1015 967.0038 967.7652 972.6128 975.6558 988.3204 990.0780 1006.1573 1008.7249 1074.1509 1077.8699 1126.2037 1128.7553 1156.0943 1200.7697 1207.7462 1271.6905 1302.3041 1303.7737 1315.3996 1346.3951 1348.9626 1353.1199 1363.0690 1407.9093 1408.8104 1454.1931 1454.3354 1462.7651 1463.1572 1479.4861 1483.8815 1534.3519 1556.8458 1568.7483 1602.1692 1605.2758 3007.3852 3007.8195 3124.4248 3124.6869 3134.0853 3134.5742 3134.7569 3136.3152 3138.3181 3141.5324 3161.6059 3162.8994 3168.5525 3183.2129 3558.7395
redmass: 3.9357 4.1591 5.7234 3.4465 6.7096 3.8657 5.1600 4.7760 4.5710 4.1308 3.8627 4.4438 1.2578 1.3022 3.9993 5.5515 6.3032 5.5485 4.9995 5.3254 2.8917 3.0162 2.8775 1.7109 4.2947 3.5500 3.3009 5.2489 6.3316 7.1498 4.6670 6.9639 7.2690 7.4536 4.1665 3.8384 5.5081 1.4074 1.5485 1.3083 1.4765 7.4188 2.5652 1.3870 1.6021 1.2108 1.2214 1.4203 1.3854 1.3699 1.3300 3.0238 3.2020 4.0759 3.1542 1.3853 1.4264 2.4753 1.1367 1.1422 1.5338 1.3082 1.4605 2.2975 1.6229 1.1536 2.1097 4.1853 3.8770 3.4320 1.0524 1.0523 1.0767 1.0814 2.1022 2.4361 5.7766 6.7370 7.3533 5.9643 6.1828 1.0291 1.0291 1.1062 1.1062 1.1006 1.0902 1.1000 1.0906 1.0892 1.0875 1.0950 1.0948 1.0957 1.0950 1.0673
irintensity: 1.1370 0.8850 0.5475 1.9687 0.8149 0.4666 0.0540 0.9729 0.8349 1.4818 0.7641 0.3460 0.1955 0.1791 2.8132 0.8316 3.9328 2.8476 3.8941 2.2248 0.4273 0.4232 50.6064 92.9308 14.9959 26.8425 12.4351 4.8655 6.6488 0.8403 21.3471 3.2877 2.0614 3.5942 1.9162 16.0989 3.6960 31.7220 63.8972 8.4073 40.7139 167.7988 29.8890 1.5035 14.8615 9.8940 2.9159 6.9667 3.1022 0.1267 18.2484 6.5646 17.5872 34.3765 100.4869 4.5597 3.0032 23.8999 21.9166 7.8947 115.4868 2.2650 7.0908 19.9193 2.9632 0.7911 17.9244 10.7584 1.2071 16.6801 16.4050 15.0788 42.6295 44.7718 26.3612 53.3332 11.5382 5.1095 7.5308 127.4894 50.8921 24.6088 26.1710 17.9064 17.3724 17.8683 5.0643 12.3972 6.9188 2.6885 3.0775 10.2914 14.0055 1.3892 2.5031 69.1065
temp: 298.150 k
press: 1.00000 atm
elementType: 16 16 8 7 6 6 6 6 6 6 6 6 6 6 6 6 6 6 6 1 1 1 1 1 1 1 1 1 1 1 1 1 1 1
symmnumber: 1
zpe: 680995.5 jmol-1
zpe.correction: 0.259377 hartree
zpe.thermalcorrener: 0.278598 hartree
zpe.thermalcorrenthalpy: 0.279543 hartree
zpe.thermalcorrgfe: 0.209645 hartree
zpe.sumelectzpe: -1505.275220 hartree
zpe.sumelectthermal: -1505.255999 hartree
zpe.sumelectthermalent: -1505.255055 hartree
zpe.sumelectthermalfe: -1505.324953 hartree
dipole: 0.1697 -2.8393 0.2447
dipole: 2.8548
quadrupole: -127.6272 -104.9785 -125.9312
quadrupole: 1.3979 5.9693 -0.5856
quadrupole: -8.1149 14.5338 -6.4189 1.3979 5.9693 -0.5856
hfenergy: -1505.5345976 hartree
pointgroup: C01 [X(C15H15N1O1S2)]
dipole: -0.0413527 1.1011629 0.2173855 debye
polarizability: 335.757101|-0.5376772|241.9378834|19.0865156|12.6648529|124.6078954 unknown
InChI: InChI=1S/C15H15NOS2/c1-18-13-7-3-11(4-8-13)15(16-17)12-5-9-14(19-2)10-6-12/h3-10,17H,1-2H3
charge 0 multiplicity 1
34 atoms
S  5.537748 1.134483 0.295513
S  -5.220723 1.732828 -0.291315
O  -1.195716 -3.548502 -0.46243
N  0.109677 -2.884422 -0.375573
C  1.323394 -0.873027 -0.116368
C  -1.255894 -0.765803 -0.268885
C  0.006132 -1.562086 -0.264936
C  1.519092 0.447554 -0.599842
C  -2.335783 -1.05287 -1.151164
C  2.433215 -1.538593 0.478862
C  -1.4073 0.319647 0.635561
C  3.866619 0.413423 0.0971
C  -3.646762 0.801702 -0.223163
C  2.773268 1.086346 -0.496936
C  -3.506868 -0.275631 -1.137807
C  3.683932 -0.908503 0.58608
C  -2.58719 1.091627 0.668893
C  5.35211 2.824447 -0.497578
C  -5.016454 2.985418 1.090535
H  0.688912 0.978802 -1.076966
H  -2.25452 -1.890475 -1.847553
H  2.297597 -2.556637 0.855601
H  -0.596397 0.557554 1.332553
H  2.882604 2.101669 -0.88988
H  -4.320822 -0.511326 -1.832652
H  4.52164 -1.438505 1.053512
H  -2.665203 1.910016 1.391114
H  4.606836 3.429992 0.041453
H  5.084276 2.727939 -1.561287
H  6.342402 3.29705 -0.409164
H  -4.882909 2.477812 2.058523
H  -5.955415 3.55983 1.102956
H  -4.173908 3.663448 0.883214
H  -0.929091 -4.503405 -0.491672
