program: Gaussian 09
title: 000291354
version: EM64L-G09RevD.01
frameworkgroup: C1[X(C12H15NO)]
method: RPBEPBE
basis: SDD
operation: Freq
keyword: #p
keyword: freq=noraman
keyword: PBEPBE/SDD
title: #p freq=noraman PBEPBE/SDD
converged: YES YES NO NO
title: Mulliken charges:
elementType: O N C C C C C C C C C C C C H H H H H H H H H H H H H H H
charge: -0.236254 -0.145843 -0.405286 -0.373121 -0.374596 -0.415639 -0.420766 0.477619 -0.357212 -0.353104 -0.392054 -0.385319 0.396039 -0.224132 0.191781 0.227126 0.220405 0.204561 0.203843 0.220781 0.218806 0.214961 0.216111 0.219020 0.213369 0.213804 0.226581 0.265445 0.153074
chargesum: 0.00000
title: Mulliken charges with hydrogens summed into heavy atoms:
elementType: O N C C C C C C C C C C C C
charge: -0.236254 -0.145843 0.013621 0.051845 0.050028 0.018129 0.014364 0.477619 -0.143843 -0.139300 -0.165473 -0.119875 0.396039 -0.071058
polarizability: 2.48988244e+02 -1.41634413e+00 1.29831945e+02 1.54263289e+01 1.95263706e+00 8.20365386e+01
1716.lowfreq: -29.8757 -15.4846 -6.6218 -0.4971 -0.0007 -0.0004 0.0002 23.2581 83.6718
frequency: -29.6628 22.7376 83.6706 120.4068 177.4645 181.9501 256.3014 294.7429 313.6793 339.0251 411.1658 421.1453 431.8393 455.2668 483.9792 505.8574 539.2566 589.0890 630.9125 698.9346 727.2610 795.6004 804.0408 810.6054 820.4954 827.4025 842.3269 884.5997 917.2562 941.0943 943.7358 976.0930 991.1475 994.3545 1002.8029 1029.3432 1080.8867 1107.4887 1125.9789 1137.6410 1156.6821 1189.2027 1216.5427 1231.0793 1247.9536 1256.7059 1272.8765 1310.0155 1323.1028 1333.4146 1338.7147 1342.3325 1348.6565 1354.8042 1390.9213 1405.3891 1449.1433 1452.6946 1460.7154 1467.3465 1481.9017 1497.1735 1523.2976 1547.3257 1599.2315 1630.1852 2847.5009 2967.3992 2970.7685 2974.1451 2986.3501 2986.7915 3038.0625 3047.2126 3055.9388 3103.8737 3107.9899 3114.0349 3140.4863 3166.8889 3170.9141
redmass: 3.3373 3.9529 6.5751 3.3313 4.0178 3.6408 2.0060 3.2601 2.9484 3.6502 2.5341 2.9686 3.2886 2.2424 3.1240 2.1581 2.3163 3.3545 6.7043 4.5740 2.9923 1.4274 1.5871 2.0865 1.9271 4.2490 1.5922 2.4136 2.8569 1.3904 1.3558 1.4480 2.6604 1.6419 2.3254 2.1691 1.4667 3.1765 1.3399 2.3078 1.2700 1.2401 1.8485 1.7172 1.4105 1.6011 1.1757 1.3573 1.2281 1.3699 1.4600 1.4698 1.3143 2.5826 1.6685 2.3153 4.0015 1.1090 1.0855 1.0935 1.1102 1.1014 3.0953 7.0170 5.7940 6.6332 1.0837 1.0643 1.0718 1.0719 1.0611 1.0601 1.0961 1.1029 1.1034 1.0910 1.0920 1.0894 1.0882 1.0922 1.0929
irintensity: 0.6536 0.4047 1.5405 1.9213 6.6575 5.4299 1.3207 1.5436 3.6559 8.8397 1.4915 0.3949 9.8965 5.8572 2.7551 16.3766 8.3845 9.7519 0.5992 19.3121 0.6895 4.4519 16.2691 1.8824 47.3536 19.2477 9.8367 5.2454 24.0566 0.9212 4.6371 1.3491 4.0371 9.2936 39.5310 28.0913 2.8775 4.3228 7.3024 2.3925 0.2397 151.3972 16.8961 173.2693 7.0086 0.1738 7.5227 7.3623 4.8081 2.2290 15.6847 0.2534 18.6366 3.5839 52.6752 100.3236 31.0593 7.3150 12.6283 11.4642 12.0709 14.3358 217.2517 123.3182 566.8222 206.6344 160.4528 27.5888 19.5974 112.4508 24.4872 32.4996 61.6092 30.4978 102.0887 25.6246 11.3905 9.5471 0.8519 30.2032 13.1179
temp: 298.150 k
press: 1.00000 atm
elementType: 8 7 6 6 6 6 6 6 6 6 6 6 6 6 1 1 1 1 1 1 1 1 1 1 1 1 1 1 1
symmnumber: 1
zpe: 641338.0 jmol-1
zpe.correction: 0.244273 hartree
zpe.thermalcorrener: 0.255796 hartree
zpe.thermalcorrenthalpy: 0.256740 hartree
zpe.thermalcorrgfe: 0.205954 hartree
zpe.sumelectzpe: -595.204665 hartree
zpe.sumelectthermal: -595.193142 hartree
zpe.sumelectthermalent: -595.192198 hartree
zpe.sumelectthermalfe: -595.242984 hartree
dipole: -7.9096 1.5935 -0.4458
dipole: 8.0808
quadrupole: -104.0122 -75.7676 -86.4303
quadrupole: 9.3136 -1.1836 1.4225
quadrupole: -15.2755 12.9691 2.3064 9.3136 -1.1836 1.4225
hfenergy: -595.4489381 hartree
pointgroup: C01 [X(C12H15N1O1)]
dipole: 3.0690783 -0.5963056 -0.5767798 debye
polarizability: 243.9876592|1.1250207|129.5378642|-32.3719369|4.1147787|87.331204 unknown
InChI: InChI=1S/C12H15NO/c14-10-11-4-6-12(7-5-11)13-8-2-1-3-9-13/h4-7,10H,1-3,8-9H2
charge 0 multiplicity 1
29 atoms
O  -4.812935 0.638165 1.056609
N  1.467666 0.116799 -0.826789
C  4.120554 0.040732 0.433365
C  3.204812 1.286305 0.527497
C  3.294007 -1.24637 0.187903
C  2.261187 1.361382 -0.701372
C  2.352271 -1.053441 -1.028176
C  0.136228 0.007983 -0.412844
C  -0.519015 -1.267212 -0.30701
C  -0.651913 1.172645 -0.10033
C  -1.865681 -1.359811 0.070049
C  -1.994063 1.063869 0.27526
C  -2.635932 -0.203637 0.369577
C  -4.045255 -0.327285 0.766836
H  4.834127 0.177604 -0.40609
H  4.726523 -0.060442 1.352896
H  2.591692 1.237881 1.44841
H  3.813006 2.20967 0.582794
H  3.964789 -2.107923 0.005459
H  2.685203 -1.483117 1.082167
H  1.606756 2.242186 -0.644388
H  2.870424 1.470934 -1.622446
H  2.964591 -0.861648 -1.933719
H  1.764676 -1.960244 -1.229175
H  0.024339 -2.192097 -0.515153
H  -0.211782 2.171348 -0.158204
H  -2.335063 -2.350066 0.141288
H  -2.5824 1.95929 0.506495
H  -4.42581 -1.382098 0.80119
