program: Gaussian 09
title: 000291390
version: EM64L-G09RevD.01
frameworkgroup: C1[X(C14H12N4O5)]
method: RPBEPBE
basis: SDD
operation: Freq
keyword: #p
keyword: freq=noraman
keyword: PBEPBE/SDD
title: #p freq=noraman PBEPBE/SDD
converged: YES YES NO NO
title: Mulliken charges:
elementType: O O O O O N N N N C C C C C C C C C C C C C C H H H H H H H H H H H H
charge: -0.201423 -0.215219 -0.212350 -0.211896 -0.213108 -0.230765 -0.401385 0.021326 0.021492 0.468351 0.412513 -0.350307 -0.358924 -0.346879 -0.332510 -0.352789 -0.362035 -0.362999 -0.361866 0.393138 0.392307 0.254819 -0.762763 0.249619 0.280193 0.280652 0.262963 0.323528 0.288689 0.291610 0.290707 0.290150 0.267608 0.267754 0.219801
chargesum: 0.00000
title: Mulliken charges with hydrogens summed into heavy atoms:
elementType: O O O O O N N N N C C C C C C C C C C C C C C
charge: -0.201423 -0.215219 -0.212350 -0.211896 -0.213108 -0.230765 -0.077857 0.021326 0.021492 0.468351 0.412513 -0.100688 -0.078731 -0.066228 -0.069547 -0.064100 -0.070425 -0.072293 -0.071716 0.393138 0.392307 0.254819 -0.007599
polarizability: 4.17061851e+02 3.54047609e+00 2.25343177e+02 1.29262044e+01 -1.12818803e+01 1.20167508e+02
1716.lowfreq: -6.7997 -0.0007 -0.0006 -0.0005 2.7697 4.6843 25.1347 34.5865 38.1669
frequency: 25.0390 34.5384 38.1549 44.2520 48.8102 67.2895 73.8563 84.6130 85.1035 112.8679 124.3548 176.6531 193.9960 230.2276 251.0428 292.6837 298.7686 310.8498 343.8281 398.1455 413.0545 417.9589 448.5611 458.2695 486.7926 499.5025 507.0601 509.5952 514.0666 537.9173 602.4081 621.7606 624.8712 655.8617 659.6625 667.7510 678.3870 721.5708 728.6509 749.7850 781.6533 799.7319 827.6667 837.5789 848.7113 867.5270 895.0015 918.4164 980.4156 981.6050 983.6441 989.3540 996.8376 997.4649 999.1951 1035.2714 1097.5781 1098.2873 1107.8111 1117.3043 1129.7616 1175.1834 1181.1702 1207.7250 1217.0559 1227.7316 1273.7519 1291.4971 1304.2859 1317.0538 1354.6546 1358.4453 1387.7778 1393.3703 1409.1548 1431.4202 1439.9756 1442.2522 1450.0943 1468.1688 1480.4546 1485.6961 1585.6172 1593.9190 1600.8180 1614.0711 1647.4265 2999.1837 3094.2834 3112.6544 3161.9329 3163.4308 3168.3722 3172.5627 3185.2740 3185.8909 3188.5676 3190.6678 3499.8689
redmass: 5.7642 7.1490 8.4225 6.4819 7.1414 2.8157 6.5258 1.2462 5.4029 8.0993 6.7937 9.2969 10.1359 7.5126 6.5101 5.5794 6.1680 7.2599 3.7604 6.2775 2.9724 3.0382 5.0530 2.9737 2.4960 2.7145 3.7369 6.2889 5.7641 4.0895 2.5566 6.9548 6.5147 6.0492 5.3475 5.9192 6.3837 5.5981 5.1720 5.6842 9.2550 7.7040 1.2697 1.3199 1.6470 1.5230 4.7410 4.4915 1.9385 1.3740 1.3521 1.3574 2.8959 2.2183 1.5614 1.6466 3.4388 3.0375 2.0989 1.2942 1.6887 1.5479 1.4828 2.6562 3.5815 4.7203 3.3258 1.3842 1.4510 3.2871 7.7804 8.9569 1.3173 5.4459 9.2363 4.3599 3.0464 1.4463 1.1779 1.0878 2.4426 2.7225 7.9567 8.3195 6.3657 6.5871 7.7887 1.0366 1.0992 1.0993 1.0890 1.0895 1.0890 1.0884 1.0957 1.0960 1.0970 1.0971 1.0793
irintensity: 2.1679 1.8213 3.3080 0.7159 1.1133 8.7253 1.5080 0.1027 0.1570 5.3639 0.8708 6.3545 1.7609 3.4273 1.8380 0.3646 0.9371 0.5975 0.4587 1.9396 10.8346 1.4648 3.6103 6.6386 55.7637 34.4583 39.0900 5.4252 10.3905 23.3868 1.0000 1.1060 0.8037 14.4198 13.9038 20.2744 0.8670 6.6610 10.5252 5.2934 54.6661 1.6213 5.2124 2.2356 90.1583 19.3405 5.8333 3.6142 22.4975 3.7750 2.1275 4.2522 0.0555 0.1829 0.7037 7.6936 7.8998 46.3706 2.1937 11.8934 16.2168 542.4107 143.7995 181.8700 1029.6862 114.4627 17.0773 23.2662 5.8244 217.2636 108.4817 110.0626 82.4949 19.7370 18.9710 15.3596 15.4355 83.1201 14.6488 18.3289 13.5098 180.4464 14.5022 10.7478 552.5695 66.8070 132.0037 6.6064 11.1264 6.6398 3.8997 4.3753 1.2123 1.6158 0.2329 1.4539 5.5971 4.0903 18.0371
temp: 298.150 k
press: 1.00000 atm
elementType: 8 8 8 8 8 7 7 7 7 6 6 6 6 6 6 6 6 6 6 6 6 6 6 1 1 1 1 1 1 1 1 1 1 1 1
symmnumber: 1
zpe: 654900.6 jmol-1
zpe.correction: 0.249438 hartree
zpe.thermalcorrener: 0.270050 hartree
zpe.thermalcorrenthalpy: 0.270994 hartree
zpe.thermalcorrgfe: 0.196895 hartree
zpe.sumelectzpe: -1133.999364 hartree
zpe.sumelectthermal: -1133.978753 hartree
zpe.sumelectthermalent: -1133.977809 hartree
zpe.sumelectthermalfe: -1134.051908 hartree
dipole: 0.5922 6.8212 -4.2319
dipole: 8.0492
quadrupole: -207.5643 -122.0491 -132.8850
quadrupole: 0.2742 3.9348 -9.4780
quadrupole: -53.3982 32.1171 21.2811 0.2742 3.9348 -9.4780
hfenergy: -1134.248803 hartree
pointgroup: C01 [X(C14H12N4O5)]
dipole: 0.4038839 -1.8154408 2.5631225 debye
polarizability: 415.0941213|-8.6917997|200.9553691|-25.9711198|-45.3810776|146.523046 unknown
InChI: InChI=1S/C14H12N4O5/c1-10(19)15-16(11-2-6-13(7-3-11)17(20)21)12-4-8-14(9-5-12)18(22)23/h2-9,15H,1H3
charge 0 multiplicity 1
35 atoms
O  -0.588933 -3.271769 -0.419736
O  -6.039493 1.153475 0.183223
O  5.234676 2.593175 -1.258053
O  -5.20908 2.031923 -1.755619
O  6.108776 0.482568 -1.213224
N  0.077575 -0.74607 0.614139
N  0.107153 -1.936393 1.36054
N  -5.075676 1.367089 -0.653865
N  5.132108 1.317979 -1.064879
C  -1.204513 -0.207671 0.292549
C  1.324408 -0.233515 0.151163
C  -2.295038 -0.4037 1.18415
C  1.500712 1.168384 -0.039151
C  -1.412182 0.492851 -0.928997
C  2.424062 -1.112937 -0.054484
C  -3.564009 0.109309 0.876058
C  2.744415 1.676228 -0.442392
C  -2.678122 1.010506 -1.239623
C  3.670704 -0.607306 -0.454972
C  -3.744348 0.82159 -0.330634
C  3.821662 0.784067 -0.648327
C  -0.251751 -3.17425 0.786938
C  -0.221307 -4.338824 1.766494
H  -2.142988 -0.956565 2.115092
H  0.673155 1.856104 0.15454
H  -0.594746 0.593032 -1.647435
H  2.290237 -2.189378 0.074758
H  0.439662 -1.870635 2.326896
H  -4.413624 -0.021815 1.550996
H  2.902914 2.748517 -0.583148
H  -2.862351 1.538069 -2.178962
H  4.523387 -1.267512 -0.63303
H  -1.256396 -4.669401 1.964663
H  0.308653 -5.184789 1.299253
H  0.261298 -4.098343 2.729577
