program: Gaussian 09
title: 000291361
version: EM64L-G09RevD.01
frameworkgroup: C1[X(C18H22N2)]
method: RPBEPBE
basis: SDD
operation: Freq
keyword: #pfreq=noraman
keyword: PBEPBE/SDD
title: #p freq=noraman PBEPBE/SDD
converged: YES YES NO NO
title: Mulliken charges:
elementType: N N C C C C C C C C C C C C C C C C C C H H H H H H H H H H H H H H H H H H H H H H
charge: -0.150894 -0.150875 0.394160 0.394153 0.550890 0.550883 -0.363123 -0.363098 -0.374740 -0.374740 -0.427069 -0.427105 -0.447664 -0.447645 -0.356449 -0.356419 -0.648035 -0.646699 -0.648097 -0.646667 0.231047 0.231056 0.232064 0.232062 0.216838 0.216840 0.218751 0.218749 0.211716 0.211706 0.232442 0.232912 0.214409 0.232467 0.232874 0.214095 0.232609 0.214414 0.232739 0.232477 0.214097 0.232868
chargesum: 0.00000
title: Mulliken charges with hydrogens summed into heavy atoms:
elementType: N N C C C C C C C C C C C C C C C C C C
charge: -0.150894 -0.150875 0.394160 0.394153 0.550890 0.550883 -0.132075 -0.132041 -0.142676 -0.142678 -0.210232 -0.210265 -0.228914 -0.228896 -0.144733 -0.144713 0.031729 0.032737 0.031665 0.032774
polarizability: 5.92187904e+02 6.60441858e+00 1.98473124e+02 -2.56134489e-02 1.38567199e-01 1.03053354e+02
1716.lowfreq: -4.8304 -0.0009 0.0012 0.0012 9.0314 10.4167 21.5751 25.8101 47.6220
frequency: 21.5749 25.8100 47.6219 55.7468 71.9434 73.4081 92.7163 100.0129 135.1656 139.1805 157.5426 182.6992 206.7223 206.8219 231.8794 232.6101 247.5007 294.2548 350.7804 354.2104 399.0026 419.1593 420.8881 422.9026 427.7964 472.9538 502.3997 506.8782 512.0890 538.9747 566.6201 633.8102 640.7896 701.6782 726.7104 731.1553 745.2192 800.6357 801.6895 808.6166 821.0219 821.2444 866.7582 875.3489 932.5916 942.5555 945.1525 945.2186 948.6848 950.5786 976.3652 995.6093 996.6427 1056.4667 1056.5354 1109.4532 1109.4719 1110.1272 1110.1346 1131.1028 1134.6902 1165.9485 1167.1138 1197.1379 1202.4124 1223.9662 1251.8307 1264.5912 1264.6217 1299.2437 1307.0708 1338.2516 1339.5136 1361.8044 1362.2293 1375.8992 1387.2345 1427.4560 1428.7417 1444.2231 1445.9939 1459.2364 1460.0628 1462.6468 1462.6478 1473.4038 1473.4165 1495.1899 1495.5937 1507.3396 1509.0663 1523.5009 1532.6148 1551.4560 1556.5277 1620.9786 1635.3645 1644.3279 2933.4957 2933.5399 2941.2463 2942.3993 2996.9398 2996.9753 2999.5112 2999.5952 3077.2188 3087.7570 3092.7287 3092.7557 3102.3690 3102.4322 3111.6064 3111.9667 3126.7060 3126.8076 3158.4816 3158.5556 3163.2149 3163.5507
redmass: 3.3817 3.8286 4.4187 4.2053 2.3831 2.4048 2.6118 2.0493 4.8026 1.7300 1.6797 4.5087 1.1087 1.1055 3.2729 1.8055 2.2011 3.6651 3.2701 3.8436 4.2430 2.9086 3.1616 3.3514 4.2068 3.5762 3.6580 2.2855 3.3470 2.1508 4.0101 7.2078 7.0457 4.7115 3.0060 4.8995 3.4743 1.3426 1.2622 1.6134 1.8148 5.9151 4.3251 1.9336 1.3469 1.4980 3.1434 3.1539 1.3603 1.3639 1.1664 2.9028 2.8405 1.4869 1.4882 1.3020 1.3032 1.2513 1.2525 1.5345 1.5880 1.7485 1.6985 1.5278 1.1244 1.5420 1.2636 2.9210 2.8956 2.4260 1.4939 1.3591 1.5571 3.0513 3.7268 4.8476 3.6072 1.3684 1.2946 2.3524 2.5105 1.2160 1.2161 1.0405 1.0403 1.0464 1.0464 1.0951 1.0963 1.1876 1.0828 2.2003 2.8640 6.5110 5.9333 5.3653 6.1807 5.6170 1.0369 1.0369 1.0394 1.0396 1.0990 1.0989 1.1029 1.1028 1.0906 1.0858 1.0956 1.0956 1.0937 1.0937 1.0890 1.0888 1.0872 1.0874 1.0933 1.0933 1.0934 1.0935
irintensity: 1.2734 1.9622 1.3971 0.0001 0.0000 0.0145 10.2649 0.0010 0.0000 0.0692 0.0001 0.0000 0.0012 0.0009 0.5770 0.0165 7.2981 0.0001 0.0013 5.6925 0.4356 0.0006 0.0000 0.1213 6.1910 0.0000 5.6386 0.0015 21.6457 44.1443 0.0001 0.0000 0.5182 3.5312 0.0001 0.0002 3.1642 0.0001 0.2557 0.0001 149.1522 1.0257 0.0000 0.0000 6.1562 0.0020 0.0080 91.5381 0.1228 0.0000 56.3865 0.0000 0.4267 52.1174 1.7850 0.6297 1.3368 0.1398 0.3103 4.3899 0.0000 0.0008 21.9117 0.0000 127.6292 0.0000 13.9197 62.8054 3.5250 6.6010 0.0000 0.0001 3.3891 0.0320 625.0786 0.0003 8.3887 0.0003 12.9870 0.0001 4.3667 0.0037 54.0878 0.0751 0.0072 10.1604 30.7762 0.0004 2.6945 0.0026 176.5141 0.0000 778.8479 0.0000 8.7524 0.0001 623.2423 0.0000 3.2924 236.9193 427.8994 0.0182 3.5055 1.5771 44.9519 149.1065 0.0000 58.1880 2.4661 7.6094 118.4476 0.7500 0.0013 41.0050 0.0193 21.7909 0.4957 62.2357 55.5783 0.0902
temp: 298.150 k
press: 1.00000 atm
elementType: 7 7 6 6 6 6 6 6 6 6 6 6 6 6 6 6 6 6 6 6 1 1 1 1 1 1 1 1 1 1 1 1 1 1 1 1 1 1 1 1 1 1
symmnumber: 1
zpe: 929393.4 jmol-1
zpe.correction: 0.353987 hartree
zpe.thermalcorrener: 0.374457 hartree
zpe.thermalcorrenthalpy: 0.375401 hartree
zpe.thermalcorrgfe: 0.303084 hartree
zpe.sumelectzpe: -807.130350 hartree
zpe.sumelectthermal: -807.109880 hartree
zpe.sumelectthermalent: -807.108936 hartree
zpe.sumelectthermalfe: -807.181253 hartree
dipole: 0.0000 0.0002 0.0026
dipole: 0.0026
quadrupole: -52.6789 -106.4003 -130.2723
quadrupole: -2.7201 0.0960 0.0163
quadrupole: 43.7716 -9.9498 -33.8218 -2.7201 0.0960 0.0163
hfenergy: -807.4843369 hartree
pointgroup: C01 [X(C18H22N2)]
dipole: -0.0000093 -0.0001374 0.0010326 debye
polarizability: 592.2554253|3.7683442|198.1349886|1.8293019|5.0232637|103.3239685 unknown
InChI: InChI=1S/C18H22N2/c1-19(2)17-11-7-15(8-12-17)5-6-16-9-13-18(14-10-16)20(3)4/h5-14H,1-4H3
charge 0 multiplicity 1
42 atoms
N  6.223538 -0.148554 0.014047
N  -6.222281 0.151031 -0.012119
C  4.829749 -0.006283 0.01914
C  -4.828498 0.008647 -0.015632
C  1.941051 0.279131 0.025433
C  -1.939787 -0.276663 -0.02008
C  3.963682 -1.147206 -0.043602
C  -3.962517 1.149694 0.045665
C  4.210244 1.28174 0.086571
C  -4.208916 -1.279519 -0.079632
C  2.568479 -1.000893 -0.040289
C  -2.567304 1.003446 0.04314
C  2.810893 1.406587 0.088857
C  -2.809556 -1.4043 -0.081257
C  0.488648 0.484338 0.029792
C  -0.487388 -0.481805 -0.024295
C  6.826758 -1.483276 -0.064864
C  7.080522 1.039503 0.085431
C  -6.82539 1.485978 0.062952
C  -7.07933 -1.037431 -0.076211
H  4.385859 -2.155215 -0.095059
H  -4.384784 2.157737 0.095788
H  4.821176 2.187703 0.136309
H  -4.81975 -2.185661 -0.127131
H  1.951975 -1.90584 -0.090374
H  -1.950865 1.908506 0.091977
H  2.370874 2.411171 0.141284
H  -2.369501 -2.408996 -0.131171
H  0.176923 1.538291 0.082643
H  -0.175662 -1.535788 -0.076541
H  6.54261 -2.118783 0.799451
H  6.528207 -2.017609 -0.990391
H  7.924445 -1.390158 -0.068453
H  6.915925 1.720532 -0.775225
H  6.904326 1.620121 1.014552
H  8.13804 0.731177 0.075257
H  -6.53683 2.120221 -0.800725
H  -7.923129 1.393338 0.061249
H  -6.531201 2.021588 0.989273
H  -6.913352 -1.71413 0.787603
H  -8.136836 -0.729083 -0.065952
H  -6.90455 -1.622583 -1.002707
