program: Gaussian 09
title: 000291343
version: EM64L-G09RevD.01
frameworkgroup: C1[X(C14H13N5O2)]
method: RPBEPBE
basis: SDD
operation: Freq
keyword: #p
keyword: freq=noraman
keyword: PBEPBE/SDD
title: #p freq=noraman PBEPBE/SDD
converged: YES YES NO NO
title: Mulliken charges:
elementType: O O N N N N N C C C C C C C C C C C C C C H H H H H H H H H H H H H
charge: -0.216020 -0.215979 -0.417914 -0.081733 0.020641 0.044586 -0.104990 0.469373 0.149203 0.380008 -0.251980 -0.313774 -0.337552 -0.339867 -0.410015 -0.356063 -0.188845 -0.188915 -0.253017 0.033613 -0.790993 0.280997 0.264049 0.284455 0.287559 0.221988 0.289864 0.230313 0.232303 0.304704 0.234155 0.229864 0.277464 0.232517
chargesum: 0.00000
title: Mulliken charges with hydrogens summed into heavy atoms:
elementType: O O N N N N N C C C C C C C C C C C C C C
charge: -0.216020 -0.215979 -0.113210 -0.081733 0.020641 0.044586 -0.104990 0.469373 0.149203 0.380008 0.029017 -0.049725 -0.053096 -0.052308 -0.188028 -0.066198 0.041468 0.043388 -0.018862 0.033613 -0.051148
polarizability: 6.67476243e+02 -1.10262584e+00 2.16218713e+02 2.14370639e+00 -1.11333470e+01 9.09514022e+01
1716.lowfreq: 0.0003 0.0005 0.0006 1.5032 2.3138 4.7865 15.5556 29.2127 34.2295
frequency: 15.4481 29.1542 34.2125 54.2914 68.7685 79.5202 93.1161 137.1755 155.2015 169.5981 202.5686 222.9493 235.2323 244.9296 305.8387 309.7666 342.7384 391.4897 406.0406 413.6136 441.5065 467.9844 496.3051 508.5698 532.9003 540.6524 577.3916 612.9922 620.0774 627.6148 653.4540 666.4014 682.0102 692.8446 748.2080 765.4420 771.2337 830.7053 836.3745 849.1601 857.4285 880.1401 913.1447 923.6357 973.1060 978.0727 983.2872 993.0081 995.6635 997.7590 1005.4573 1019.7028 1038.1823 1084.1127 1090.3587 1100.9115 1137.2372 1171.6440 1176.5332 1179.1741 1186.8445 1211.0323 1256.4568 1280.4732 1294.6180 1301.2082 1322.9786 1355.1181 1382.8761 1390.7253 1403.2198 1426.1485 1431.4015 1457.5323 1462.3321 1474.2307 1479.3422 1483.1237 1529.3200 1577.8316 1598.8857 1603.8187 1608.6026 2960.4845 3031.3257 3114.9437 3122.3850 3137.5134 3149.2100 3164.9464 3166.5651 3168.6117 3184.3900 3185.0695 3189.5618 3392.0713
redmass: 5.7873 6.9159 4.2230 5.5148 6.9215 4.6269 5.6682 4.2224 2.3551 2.7806 2.9282 6.5908 4.3830 4.0298 5.6989 5.4785 4.7579 5.2626 2.8970 3.0107 5.8440 2.7920 6.6575 3.2073 4.6193 3.6309 6.1094 6.5245 6.9990 6.5091 1.6608 4.6062 5.2418 1.9657 4.6877 1.7044 8.7638 6.2646 1.2601 1.2468 4.3779 1.6717 1.4243 7.2328 1.3597 1.8317 5.8234 2.7215 1.3445 1.3192 1.3635 2.1022 1.5030 1.5434 3.3296 1.2521 1.9242 1.1052 1.1899 2.8659 2.5566 6.0032 3.3874 1.4223 3.5824 2.8157 1.7386 8.7030 3.2668 1.5897 7.4138 4.4078 2.1574 1.6753 2.4232 2.0206 1.0564 2.4777 1.9799 7.8329 6.6208 4.6099 6.0505 1.0402 1.0977 1.0887 1.0946 1.0868 1.0930 1.0894 1.0881 1.0984 1.0967 1.0963 1.0967 1.0741
irintensity: 0.1557 0.2021 0.1003 0.0802 0.1166 1.2115 1.1233 10.5977 2.5268 5.1552 13.2453 7.0999 4.2964 1.0795 5.0769 7.9828 3.4625 4.1746 0.0693 1.3984 1.7033 40.4423 6.5199 5.4196 0.8181 10.4989 20.5842 1.4900 5.9794 15.1332 37.5604 25.3198 9.1243 56.9420 1.3542 85.3587 41.0580 2.0650 0.0308 0.7365 1.7461 68.3947 9.2157 38.8112 0.1233 26.1229 0.7585 0.4227 0.5653 1.3251 0.3630 5.1390 2.7113 10.7984 55.6317 16.9650 298.3912 2.8377 12.0524 31.7355 30.4475 1326.6775 69.1462 49.4186 334.2009 195.9038 23.1682 105.4508 13.9273 31.4663 14.5248 35.5826 14.5139 48.0641 21.3088 345.1474 24.5411 13.8411 173.4298 27.6576 104.8052 10.3712 34.1028 23.3257 19.6842 11.2144 1.2601 1.4928 24.1331 1.3938 1.4127 43.4715 5.9837 0.2362 0.2658 52.0378
temp: 298.150 k
press: 1.00000 atm
elementType: 8 8 7 7 7 7 7 6 6 6 6 6 6 6 6 6 6 6 6 6 6 1 1 1 1 1 1 1 1 1 1 1 1 1
symmnumber: 1
zpe: 662834.3 jmol-1
zpe.correction: 0.252460 hartree
zpe.thermalcorrener: 0.271042 hartree
zpe.thermalcorrenthalpy: 0.271986 hartree
zpe.thermalcorrgfe: 0.202651 hartree
zpe.sumelectzpe: -963.854921 hartree
zpe.sumelectthermal: -963.836340 hartree
zpe.sumelectthermalent: -963.835396 hartree
zpe.sumelectthermalfe: -963.904730 hartree
dipole: 9.9529 3.1522 0.3276
dipole: 10.4452
quadrupole: -147.0987 -105.0079 -125.0967
quadrupole: -0.3945 -2.4338 0.1235
quadrupole: -21.3642 20.7265 0.6377 -0.3945 -2.4338 0.1235
hfenergy: -964.1073813 hartree
pointgroup: C01 [X(C14H13N5O2)]
dipole: -3.8992145 1.1774296 0.5455108 debye
polarizability: 667.2583741|-9.2572908|168.9189419|6.5897306|61.6744833|138.4690425 unknown
InChI: InChI=1S/C14H13N5O2/c1-11(15-17-12-5-3-2-4-6-12)16-18-13-7-9-14(10-8-13)19(20)21/h2-10,17H,1H3
charge 0 multiplicity 1
34 atoms
O  6.887555 -0.348578 0.768114
O  6.552602 -1.515709 -1.165589
N  -3.410078 0.982637 0.438614
N  0.578926 0.536372 -0.166965
N  6.129484 -0.783865 -0.186158
N  -2.085383 0.73803 0.301728
N  0.159032 1.379505 0.759909
C  -4.371962 0.04835 -0.017106
C  1.977795 0.263708 -0.091693
C  4.696707 -0.423284 -0.155356
C  2.853975 0.719503 0.940653
C  2.489039 -0.544662 -1.146597
C  4.21299 0.378974 0.908573
C  3.849307 -0.891211 -1.18662
C  -5.747373 0.359914 0.146503
C  -3.976047 -1.170509 -0.626993
C  -6.726038 -0.550895 -0.301235
C  -4.96764 -2.06849 -1.068285
C  -6.343309 -1.769221 -0.910194
C  -1.222948 1.614387 0.833844
C  -1.622684 2.84989 1.612951
H  2.440373 1.334464 1.744749
H  1.791168 -0.883271 -1.918297
H  4.911439 0.711873 1.680926
H  4.26668 -1.508338 -1.986006
H  -6.048855 1.303945 0.618702
H  -2.910514 -1.383975 -0.741998
H  -7.786657 -0.308856 -0.174002
H  -4.665224 -3.009945 -1.539726
H  -3.755776 1.853357 0.868695
H  -7.105265 -2.474985 -1.256636
H  -2.283475 2.607215 2.469829
H  -0.715342 3.329756 2.007669
H  -2.148503 3.588517 0.974797
