program: Gaussian 09
title: 000027942
version: EM64L-G09RevD.01
frameworkgroup: C1[X(C7H5ClN2O3)]
method: RPBEPBE
basis: SDD
operation: Freq
keyword: #p
keyword: freq=noraman
keyword: PBEPBE/SDD
title: #p freq=noraman PBEPBE/SDD
converged: YES YES NO NO
title: Mulliken charges:
elementType: Cl O O O N N C C C C C C C H H H H H
charge: 0.056698 -0.258814 -0.191331 -0.176599 0.017583 -0.636304 0.353515 0.507104 -0.492676 -0.332253 -0.304401 -0.198943 0.166093 0.338231 0.214926 0.267725 0.321252 0.348194
chargesum: 0.00000
title: Mulliken charges with hydrogens summed into heavy atoms:
elementType: Cl O O O N N C C C C C C C
charge: 0.056698 -0.258814 -0.191331 -0.176599 0.017583 0.033142 0.353515 0.507104 -0.154445 -0.117327 -0.304401 0.068782 0.166093
polarizability: 1.70385036e+02 -2.69034616e+00 1.28297545e+02 -2.60945497e-02 -5.51004252e-02 4.17403175e+01
1716.lowfreq: -41.7264 -25.6542 -0.0032 -0.0020 -0.0015 2.5792 5.6735 8.8628 74.5963
frequency: -41.7126 -25.6274 74.5815 145.3958 147.2475 214.8888 269.0259 294.8432 308.6293 339.5918 425.5549 449.3349 459.9728 501.7509 510.2065 543.3149 597.2630 637.1569 653.3150 667.2475 726.7603 736.4646 741.0697 830.8778 859.3725 953.4327 994.5511 1020.7528 1050.5102 1096.2270 1126.8189 1176.7290 1195.8339 1246.3831 1345.6562 1369.6340 1377.3786 1408.2456 1470.5281 1554.8512 1591.9216 1604.4497 1643.3011 3140.6954 3172.9000 3175.4566 3532.8501 3684.2161
redmass: 16.2356 4.7716 7.7190 5.3193 8.6178 16.9866 6.2131 14.3532 6.1510 9.7850 2.2100 1.8867 6.6623 6.6203 2.2654 4.3266 1.4940 4.9918 7.7858 3.5931 5.6209 9.7939 3.7378 1.5870 7.3245 1.4421 1.4027 6.3330 1.8506 1.6879 5.6179 1.4645 10.0720 1.4337 3.0028 4.6558 11.4968 6.1335 2.9640 6.0596 2.4831 5.1838 2.1556 1.0896 1.0915 1.0953 1.0454 1.1036
irintensity: 0.2126 12.3855 0.4037 1.6087 3.0547 1.4640 0.2384 0.6016 11.7514 0.0716 18.4242 10.2270 1.1610 14.6148 134.8778 19.4061 75.1842 3.4229 15.8576 54.2717 7.4093 22.4203 54.7544 23.9463 13.3496 1.4584 19.0984 54.0280 0.4960 29.1060 1.6865 0.3719 238.5772 40.6752 111.8560 138.9638 88.3503 11.4004 48.7086 25.9725 108.2910 22.2200 274.1561 13.4394 13.6745 9.8938 53.6022 34.5396
temp: 298.150 k
press: 1.00000 atm
elementType: 17 8 8 8 7 7 6 6 6 6 6 6 6 1 1 1 1 1
symmnumber: 1
zpe: 305449.6 jmol-1
zpe.correction: 0.116340 hartree
zpe.thermalcorrener: 0.126189 hartree
zpe.thermalcorrenthalpy: 0.127134 hartree
zpe.thermalcorrgfe: 0.080325 hartree
zpe.sumelectzpe: -1063.970632 hartree
zpe.sumelectthermal: -1063.960782 hartree
zpe.sumelectthermalent: -1063.959838 hartree
zpe.sumelectthermalfe: -1064.006647 hartree
dipole: -4.1494 -7.2701 0.0291
dipole: 8.3710
quadrupole: -79.0129 -83.5595 -81.7221
quadrupole: 9.7442 -0.1480 -0.0061
quadrupole: 2.4186 -2.1280 -0.2906 9.7442 -0.1480 -0.0061
hfenergy: -1064.0869716 hartree
pointgroup: C01 [X(C7H5Cl1N2O3)]
dipole: 1.9899407 -2.6242026 -0.0103763 debye
dipolederiv: -0.5453859 -0.3142224 -0.0001701 -0.3155082 -0.213772 -0.0000441 -0.0001819 -0.000083 0.0075342 -0.7752181 -0.1838846 -0.0000127 -0.0487513 -0.9206032 -0.004764 0.0015212 -0.0033286 -0.3617212 -0.4801693 0.0554579 -0.0002608 -0.0024278 -0.8217985 0.0004933 -0.0002468 0.000657 -0.2165458 -0.7601741 0.0134495 -0.0004947 0.0695051 -0.4426442 0.0002773 -0.0005767 0.0001819 -0.2023904 1.2946209 -0.3541454 0.0013195 -0.2723901 1.3820917 -0.0012179 0.0011061 -0.0012983 0.1894522 -1.1149128 0.394526 0.0039434 0.3575034 -0.4890193 0.0016299 0.0038137 0.0022438 -0.699859 -0.3690486 0.0419924 -0.000079 -0.1520794 -0.2637663 -0.00053 -0.0011567 -0.0005841 0.0196396 -0.4036354 0.1638791 -0.0005818 0.1774355 -0.3834985 0.0006332 -0.0006008 0.0004791 0.0948929 0.1051479 -0.1842139 0.0003285 -0.0402453 -0.086436 -0.0001634 -0.0004666 0.0001981 -0.0625902 0.178954 -0.0048764 0.0005868 0.1116454 0.1629382 -0.0006259 0.0020508 -0.0001721 -0.1273112 0.9266723 0.5709066 0.0003702 0.0900864 0.4265354 -0.0003933 0.0009251 0.0001668 -0.0607611 -0.5834105 -0.121155 -0.0003293 0.0680704 0.0553583 -0.0002026 -0.0000648 -0.0003573 -0.0798058 1.7849256 -0.0870567 -0.0047571 -0.1113861 1.163537 0.0084884 -0.0057752 0.0060761 0.2475916 0.2041035 -0.0128065 0.0000396 0.0117129 0.1424209 0.0001649 0.0006145 -0.0000544 0.169017 -0.0561281 0.1030912 -0.0002588 0.1009948 0.0404641 0.0003844 -0.000693 0.0000444 0.1509613 0.0715757 -0.0327556 -0.0000829 -0.0176178 -0.0195171 0.0002371 -0.0002 0.0002377 0.1603162 0.2845009 -0.033311 0.0000158 -0.032387 0.1018256 -0.0025307 -0.000475 -0.0027999 0.3837758 0.2375818 -0.0148752 0.0004234 0.0058388 0.1658839 -0.0018367 0.0004062 -0.0016071 0.3878038 unknown
polarizability: 168.9836184|8.0159767|129.6989708|0.0254846|0.0500175|41.7403083 unknown
InChI: InChI=1S/C7H5ClN2O3/c8-5-2-1-4(7(9)11)3-6(5)10(12)13/h1-3H,9H2
charge 0 multiplicity 1
18 atoms
Cl -2.881538 -2.005433 -0.000427
O  2.910564 1.698312 0.010556
O  -1.734506 2.455952 -0.003201
O  -3.332314 0.838024 -0.003539
N  -2.104577 1.219163 -0.00256
N  3.874753 -0.404191 -0.006387
C  1.405485 -0.202784 0.001525
C  -1.022938 0.184627 -0.000723
C  0.301153 0.673291 0.000068
C  1.163132 -1.600487 0.002963
C  -1.259319 -1.216954 0.000322
C  -0.153132 -2.096386 0.002388
C  2.776615 0.43777 0.00241
H  0.476578 1.753269 -0.000215
H  1.981178 -2.328719 0.005774
H  -0.339035 -3.174084 0.003751
H  3.814618 -1.419082 -0.016528
H  4.796483 0.031712 -0.005476
