program: Gaussian 09
title: 000291320
version: EM64L-G09RevD.01
frameworkgroup: C1[X(C16H12S)]
method: RPBEPBE
basis: SDD
operation: Freq
keyword: #pfreq=noraman
keyword: PBEPBE/SDD
title: #p freq=noraman PBEPBE/SDD
converged: YES YES NO NO
title: Mulliken charges:
elementType: S C C C C C C C C C C C C C C C C H H H H H H H H H H H H
charge: 0.221321 0.361287 0.380054 -0.324078 -0.216447 -0.407252 -0.259178 -0.420267 -0.408057 -0.241649 -0.243893 -0.211403 -0.224888 -0.242627 -0.217379 -0.211499 -0.227660 0.259737 0.238075 0.241789 0.238670 0.236631 0.226924 0.227198 0.264396 0.261008 0.233535 0.233138 0.232512
chargesum: 0.00000
title: Mulliken charges with hydrogens summed into heavy atoms:
elementType: S C C C C C C C C C C C C C C C C
charge: 0.221321 0.361287 0.380054 -0.064341 -0.216447 -0.169177 -0.017389 -0.181597 -0.171426 -0.014725 -0.016695 -0.211403 0.039508 0.018381 0.016156 0.021639 0.004853
polarizability: 2.68976678e+02 -6.41477026e-01 2.00001101e+02 -7.34482407e+00 4.99118775e-01 1.11879411e+02
1716.lowfreq: 0.0010 0.0010 0.0019 3.7901 6.1431 10.5961 12.0808 30.2183 46.3231
frequency: 10.5386 30.1856 46.3084 95.2415 160.4490 181.6100 221.7946 257.0565 272.2532 344.0291 380.5302 393.2961 403.7069 429.7698 474.9085 502.4910 511.9916 514.4545 589.4910 610.4221 632.9564 637.1167 680.3671 696.5471 753.8117 757.3793 759.0432 778.9379 823.2177 833.4299 851.7737 866.5537 907.3208 927.4640 929.1976 955.4766 972.8950 979.4417 985.6514 990.0407 999.4722 1015.0384 1022.8366 1060.1005 1071.0277 1079.1322 1130.0447 1160.1928 1172.4041 1172.8144 1181.9893 1225.3887 1247.1634 1275.4421 1300.2086 1342.0552 1373.2104 1406.4690 1420.3071 1425.5577 1432.0885 1450.5264 1459.4947 1506.4263 1578.2452 1586.8416 1586.8782 1594.3097 1632.9628 3119.5659 3123.6280 3125.4269 3129.8690 3139.8125 3140.0102 3142.2665 3148.2402 3152.6275 3161.4376 3161.4665 3171.5349
redmass: 4.4808 4.0407 5.4928 5.6678 5.1471 3.6938 5.2648 4.9345 5.9274 9.2011 5.5182 3.1283 2.8224 5.9316 2.5098 4.1620 5.6586 3.9678 7.3837 6.4742 6.6113 3.3227 6.6890 2.2012 1.2618 1.5781 4.4004 2.6039 1.3789 6.0878 1.2464 1.4059 1.6562 2.1815 2.1690 1.3476 1.4034 1.3904 6.3093 1.3416 1.3172 3.3435 2.3297 2.4381 1.5956 2.4638 1.6844 1.2262 1.0542 1.0773 1.1135 1.9974 1.4304 1.7752 1.3174 1.8340 9.7790 5.2253 2.7773 2.1013 4.4489 2.2557 2.1129 3.5419 7.3246 6.0840 6.2236 5.6748 6.7482 1.0854 1.0873 1.0884 1.0850 1.0902 1.0897 1.0947 1.0975 1.0931 1.0968 1.1003 1.1014
irintensity: 0.3810 0.1961 0.2602 0.3471 0.2569 1.8485 2.0820 0.0099 0.4204 2.4229 0.7899 0.2620 0.0864 0.5561 24.2176 13.9171 0.8715 3.1482 8.1022 0.1977 0.3304 1.4590 6.0198 46.2779 36.4137 57.4185 5.6137 4.5155 59.4542 28.0859 1.7689 25.0378 5.2494 3.3931 19.7101 1.4333 5.3055 0.0172 6.1425 0.0164 0.1814 15.9748 3.7235 18.9163 7.8728 0.1702 21.9017 3.4984 0.0091 0.6834 3.8270 14.6890 2.4553 7.7980 0.8570 3.7699 1.0396 4.1954 0.6072 10.1642 6.5472 28.3237 21.3812 29.7566 1.4487 18.0496 6.0208 38.2873 39.3472 3.5318 4.2714 1.8955 0.2526 2.3672 4.3592 33.7900 21.3250 17.5137 18.1931 38.2743 16.0280
temp: 298.150 k
press: 1.00000 atm
elementType: 16 6 6 6 6 6 6 6 6 6 6 6 6 6 6 6 6 1 1 1 1 1 1 1 1 1 1 1 1
symmnumber: 1
zpe: 590797.7 jmol-1
zpe.correction: 0.225023 hartree
zpe.thermalcorrener: 0.238644 hartree
zpe.thermalcorrenthalpy: 0.239588 hartree
zpe.thermalcorrgfe: 0.181846 hartree
zpe.sumelectzpe: -1013.817071 hartree
zpe.sumelectthermal: -1013.803450 hartree
zpe.sumelectthermalent: -1013.802506 hartree
zpe.sumelectthermalfe: -1013.860248 hartree
dipole: 0.4354 -1.7539 0.1148
dipole: 1.8108
quadrupole: -92.9048 -98.5427 -106.0310
quadrupole: -9.1597 -1.7121 0.1869
quadrupole: 6.2547 0.6168 -6.8715 -9.1597 -1.7121 0.1869
hfenergy: -1014.0420944 hartree
pointgroup: C01 [X(C16H12S1)]
dipole: -0.1469251 0.6939863 0.0657362 debye
polarizability: 268.9668841|-3.1945951|200.1003233|5.8493742|1.7240876|111.7899831 unknown
InChI: InChI=1S/C16H12S/c1-2-8-15(9-3-1)17-16-11-10-13-6-4-5-7-14(13)12-16/h1-12H
charge 0 multiplicity 1
29 atoms
S  -1.6938 -2.07514 -0.032695
C  1.759907 0.309762 -0.003202
C  2.794874 -0.70139 0.076887
C  0.382605 -0.089799 -0.036158
C  0.03948 -1.441026 0.016175
C  2.402343 -2.080781 0.124472
C  1.058455 -2.448815 0.097689
C  2.145479 1.691121 -0.051312
C  4.168732 -0.295688 0.106714
C  3.493548 2.057612 -0.020993
C  4.514955 1.057525 0.05881
C  -2.694364 -0.529373 0.09003
C  -2.902688 0.081794 1.348848
C  -3.306341 -0.006822 -1.072353
C  -3.723176 1.229585 1.440433
C  -4.133911 1.136919 -0.972977
C  -4.341042 1.756587 0.281183
H  -0.391704 0.682182 -0.102551
H  3.177146 -2.854206 0.186624
H  0.773212 -3.505887 0.141606
H  1.364103 2.458075 -0.11254
H  4.947941 -1.065189 0.167666
H  3.775908 3.115659 -0.05838
H  5.567756 1.35949 0.081874
H  -2.428927 -0.339062 2.241541
H  -3.134531 -0.490423 -2.039198
H  -3.884584 1.703938 2.414637
H  -4.611294 1.540181 -1.872723
H  -4.981985 2.642071 0.356194
