program: Gaussian 09
title: 000291327
version: EM64L-G09RevD.01
frameworkgroup: C1[X(C19H12OS2)]
method: RPBEPBE
basis: SDD
operation: Freq
keyword: #p
keyword: freq=noraman
keyword: PBEPBE/SDD
title: #p freq=noraman PBEPBE/SDD
converged: YES YES NO NO
title: Mulliken charges:
elementType: S S O C C C C C C C C C C C C C C C C C C C H H H H H H H H H H H H
charge: 0.206128 0.338066 -0.256132 0.491823 -0.336121 0.386868 0.092930 -0.318336 -0.407117 -0.311646 -0.133695 -0.342155 -0.287703 -0.263257 -0.244202 -0.221987 -0.252945 -0.232446 -0.227840 -0.215500 -0.216402 -0.228559 0.249223 0.267653 0.288693 0.246481 0.237919 0.237545 0.236435 0.260292 0.260471 0.232232 0.232247 0.231037
chargesum: 0.00000
title: Mulliken charges with hydrogens summed into heavy atoms:
elementType: S S O C C C C C C C C C C C C C C C C C C C
charge: 0.206128 0.338066 -0.256132 0.491823 -0.336121 0.386868 0.092930 -0.318336 -0.407117 -0.062423 0.133958 -0.053463 -0.041222 -0.025338 -0.006657 0.014448 -0.252945 0.027846 0.032631 0.016733 0.015845 0.002478
polarizability: 4.28816526e+02 -1.60501878e+01 2.33454481e+02 1.48995695e+00 8.16481499e-01 1.29699793e+02
1716.lowfreq: -8.2473 -4.3538 -0.0004 0.0020 0.0022 2.7604 6.8862 31.1284 51.7634
frequency: 5.3522 31.0302 51.7540 55.5647 78.5565 127.6162 131.1452 177.4745 198.6803 204.9833 243.8038 253.7268 285.6439 322.8573 338.3897 376.7202 401.8867 403.2851 418.1377 437.9236 446.3050 469.0195 472.2681 502.8340 517.2949 541.7580 583.7636 610.0329 633.7894 663.9597 669.9032 689.4941 698.9103 729.3132 738.4297 758.2801 761.9331 766.2270 785.8552 810.7660 854.8943 883.0805 897.5919 908.9952 928.4756 975.1496 978.5884 983.8776 985.4343 998.4106 1008.5085 1012.7194 1030.5977 1054.7242 1059.5540 1069.9835 1075.6944 1085.4680 1120.8156 1159.0004 1167.3557 1171.7385 1174.3343 1181.7053 1204.6864 1250.7510 1299.6059 1300.1840 1356.3137 1371.3891 1388.1523 1404.7222 1414.4719 1423.7680 1423.8761 1456.9726 1458.4322 1505.6434 1557.0957 1574.8078 1581.4266 1585.2356 1585.8775 1603.9666 3127.4442 3133.2348 3136.4670 3137.0556 3145.5251 3148.2105 3156.3881 3156.7395 3158.9873 3168.3204 3171.9767 3177.5258
redmass: 6.6068 4.3394 6.0536 5.7949 6.3404 5.6753 7.1280 4.3704 6.8836 5.3565 5.5618 5.7273 6.6239 7.8678 8.9897 10.6824 2.8419 9.0615 3.6276 9.0123 9.2233 10.5627 3.7756 3.8047 4.4485 5.3690 6.9491 6.4752 7.0443 3.8697 6.7347 7.3508 2.0478 3.4782 7.8098 1.7984 1.4283 5.2296 1.4153 4.1083 1.2449 1.4227 1.3714 6.9288 1.3837 1.3686 1.3878 1.3530 6.3792 1.3172 1.3424 3.6565 3.1609 3.5514 4.0982 1.6039 3.3169 2.3338 1.9208 1.6866 2.0953 1.0546 1.0891 1.1158 1.3637 1.5603 2.7047 1.3376 8.9104 9.6951 8.7343 3.3707 2.0405 2.0915 2.3847 2.0822 2.3682 9.0531 6.5389 6.2698 6.9230 6.2557 6.0558 6.2849 1.0848 1.0862 1.0882 1.0870 1.0901 1.0927 1.0945 1.0968 1.0943 1.1016 1.1002 1.0954
irintensity: 1.6830 0.3651 1.2283 0.7767 0.4113 0.6160 1.8705 0.0274 0.6074 0.8636 0.2258 2.0370 0.0939 6.3670 26.2371 1.6301 0.1531 6.0852 0.0643 1.7845 2.1305 17.0151 9.6301 0.2388 10.9034 0.0435 2.6728 0.1209 22.2650 21.3906 0.3934 6.3490 42.7907 17.1101 18.6839 39.8549 50.8938 45.9808 61.2434 4.2689 0.0118 0.4336 0.2864 13.3774 4.1954 1.8308 0.0546 0.0348 8.6878 0.0666 0.8829 13.1653 21.4943 15.9830 0.2599 8.0515 1.9985 1.8663 0.3740 10.2532 20.9118 0.0048 4.4534 6.0800 13.6471 8.1201 168.7206 5.8954 2.8133 0.7897 9.6433 66.4510 105.2682 16.5205 87.3862 14.4711 8.9958 143.0082 107.4454 82.2850 88.0643 1.1061 3.3256 26.3984 0.3756 0.8721 4.4542 3.9251 9.2360 14.7313 10.1173 23.7853 7.0925 32.0357 32.5951 6.4220
temp: 298.150 k
press: 1.00000 atm
elementType: 16 16 8 6 6 6 6 6 6 6 6 6 6 6 6 6 6 6 6 6 6 6 1 1 1 1 1 1 1 1 1 1 1 1
symmnumber: 1
zpe: 650329.6 jmol-1
zpe.correction: 0.247697 hartree
zpe.thermalcorrener: 0.265478 hartree
zpe.thermalcorrenthalpy: 0.266422 hartree
zpe.thermalcorrgfe: 0.198975 hartree
zpe.sumelectzpe: -1601.089689 hartree
zpe.sumelectthermal: -1601.071908 hartree
zpe.sumelectthermalent: -1601.070964 hartree
zpe.sumelectthermalfe: -1601.138411 hartree
dipole: -0.0858 2.9010 0.0948
dipole: 2.9038
quadrupole: -102.7878 -138.5396 -140.5841
quadrupole: -7.5842 0.2644 -0.0087
quadrupole: 24.5160 -11.2358 -13.2802 -7.5842 0.2644 -0.0087
hfenergy: -1601.3373861 hartree
pointgroup: C01 [X(C19H12O1S2)]
dipole: 0.0922762 -1.135747 -0.0821627 debye
polarizability: 427.8582284|-3.9867|231.4510704|-25.3420861|9.4886396|132.6615011 unknown
InChI: InChI=1S/C19H12OS2/c20-19-14-9-4-5-10-15(14)22-17-12-6-11-16(18(17)19)21-13-7-2-1-3-8-13/h1-12H
charge 0 multiplicity 1
34 atoms
S  -2.987127 -2.100421 -0.140705
S  1.540561 1.438822 -0.189317
O  -0.987376 1.983057 0.051992
C  -0.679875 -0.376278 -0.182666
C  -1.21558 -1.701674 -0.261741
C  -3.016691 0.727252 0.133922
C  -1.531339 0.824205 0.002192
C  -3.760666 -0.480328 0.089563
C  0.756109 -0.233726 -0.291625
C  -0.39413 -2.836353 -0.444109
C  1.565932 -1.37635 -0.475362
C  -3.732804 1.946617 0.316598
C  -5.17272 -0.475676 0.224025
C  0.996494 -2.663446 -0.551379
C  -5.129003 1.961842 0.450406
C  -5.853448 0.741718 0.403912
C  3.343932 0.982792 -0.340034
C  3.973106 1.025875 -1.606086
C  4.103959 0.735997 0.827276
C  5.367663 0.807348 -1.704989
C  5.497895 0.517074 0.724642
C  6.130193 0.551537 -0.540923
H  -0.838772 -3.835182 -0.50085
H  2.64925 -1.265637 -0.559769
H  -3.141057 2.866893 0.346998
H  -5.728633 -1.418966 0.187418
H  1.64563 -3.533744 -0.694597
H  -5.657997 2.910015 0.590006
H  -6.943896 0.741568 0.507348
H  3.37667 1.231419 -2.501248
H  3.607073 0.71897 1.803071
H  5.855017 0.84185 -2.685667
H  6.086344 0.326721 1.629029
H  7.210788 0.386913 -0.618625
