program: Gaussian 09
title: 000291399
version: EM64L-G09RevD.01
frameworkgroup: C1[X(C19H23F3N2O6)]
method: RPBEPBE
basis: SDD
operation: Freq
keyword: #p
keyword: freq=noraman
keyword: PBEPBE/SDD
title: #p freq=noraman PBEPBE/SDD
converged: YES YES NO NO
title: Mulliken charges:
elementType: F F F O O O O O O N N C C C C C C C C C C C C C C C C C C C H H H H H H H H H H H H H H H H H H H H H H H
charge: -0.183351 -0.136778 -0.135083 -0.287513 -0.286446 -0.220848 -0.271543 -0.242378 -0.200215 -0.375827 -0.448996 -0.184213 -0.421490 -0.516309 0.226762 -0.657046 0.238721 0.477008 0.290754 -0.387105 -0.430143 0.496249 -0.343708 -0.444143 -0.253933 -0.256012 -0.663189 -0.669690 0.135559 0.300612 0.322449 0.217265 0.259335 0.259171 0.242797 0.326627 0.255967 0.233853 0.277944 0.243414 0.307964 0.229518 0.241182 0.221614 0.217034 0.253403 0.252605 0.223538 0.222660 0.348891 0.222319 0.252668 0.218074
chargesum: 0.00000
title: Mulliken charges with hydrogens summed into heavy atoms:
elementType: F F F O O O O O O N N C C C C C C C C C C C C C C C C C C C
charge: -0.183351 -0.136778 -0.135083 -0.287513 -0.286446 -0.220848 -0.271543 -0.242378 -0.200215 -0.049201 -0.100105 0.138236 0.055110 -0.014341 0.226762 -0.167226 0.238721 0.477008 0.290754 -0.109160 -0.186730 0.496249 -0.035744 -0.214625 0.208863 0.214426 0.035614 0.023370 0.135559 0.300612
polarizability: 2.91588011e+02 -7.22196284e+00 2.48412395e+02 -2.25129384e+01 -9.84024242e+00 2.02319659e+02
1716.lowfreq: -8.9661 -1.7506 -0.0008 0.0006 0.0008 3.7952 6.0826 15.1491 17.4028
frequency: 4.9215 14.9456 17.2290 20.2641 26.2962 33.5968 35.6318 47.3495 52.0460 57.7076 59.6159 69.4938 78.5545 82.5646 95.6325 107.0195 119.0575 129.8919 150.8677 162.6704 191.7232 204.2514 219.2750 230.3684 242.8635 246.6995 258.1314 283.6582 293.6376 310.0408 330.7753 342.0001 352.9044 356.1569 380.1584 393.9844 401.1724 410.1775 422.4494 440.0224 471.4402 485.3588 503.4021 526.6552 543.3063 558.9574 574.5414 598.7408 628.8601 640.7185 650.7731 661.0985 674.9793 694.7303 705.3463 714.0734 731.8959 766.5988 767.4834 789.6100 810.3059 815.2259 820.3496 825.3478 841.2969 850.7030 864.2952 878.8923 898.7499 921.9530 932.8426 954.2873 975.8461 993.8565 1007.3026 1009.1491 1011.5553 1016.6165 1018.8708 1039.5325 1076.1230 1084.4596 1095.2442 1097.1142 1109.3578 1127.8375 1137.6639 1154.2870 1158.8046 1164.0511 1177.1580 1199.9742 1207.6011 1210.4690 1214.2653 1220.0894 1245.8734 1265.5273 1273.4879 1277.6571 1289.0594 1295.4130 1319.1674 1327.6053 1337.5822 1345.7189 1355.2971 1362.6595 1378.9081 1391.9365 1392.2158 1417.5971 1444.8514 1451.2000 1456.8954 1457.6298 1459.4821 1464.1830 1465.5225 1484.1475 1484.5305 1486.9282 1507.5656 1522.1686 1596.5538 1612.7564 1624.8988 1642.0526 1646.9950 1647.8916 2991.7408 2993.7418 2994.8384 3001.7320 3008.8822 3032.2621 3040.0214 3043.5019 3067.8229 3071.1402 3085.3535 3088.1364 3091.0486 3094.6067 3096.8502 3115.5020 3120.3074 3123.4533 3126.2606 3141.4475 3192.5407 3503.2949 3540.9410
redmass: 5.7724 4.5029 8.5462 9.6210 5.9560 5.3558 5.3028 5.6744 4.7028 3.8607 3.9824 5.6234 5.0395 4.4384 5.0655 5.9893 4.4701 4.8493 6.4850 4.6677 2.0690 2.0480 1.8423 2.5209 2.5571 6.1327 7.0388 2.1080 7.2572 2.9137 5.0354 3.7047 3.3454 4.0699 5.5239 4.5040 6.2680 2.9744 3.0046 13.5444 5.2767 4.6963 6.0502 3.2112 3.4177 3.2654 3.4934 1.5945 8.4114 6.9316 3.5613 4.5480 4.3138 3.8688 4.1647 1.5142 3.5281 2.4600 2.1673 4.1295 1.5741 1.4852 2.5503 2.7389 1.9983 7.0163 3.2430 1.4525 3.3594 2.5124 2.6702 1.4562 2.4372 2.2472 5.1676 1.6061 2.9152 3.0956 2.9649 12.2839 3.0952 6.7135 2.2237 2.1450 3.0645 1.4439 2.7523 1.6915 1.6636 1.4584 2.5032 1.2308 1.4822 3.7254 1.8589 1.7024 1.8351 2.2508 1.1162 1.1267 1.4760 1.2783 1.3472 1.4183 1.4102 1.2786 1.2775 1.4403 5.2763 1.2317 1.2367 3.1130 1.0951 1.1326 1.1011 1.0926 1.0891 1.0442 1.0479 1.2015 1.4830 1.0520 2.4980 2.1579 4.1224 6.8238 6.2503 8.7800 9.5374 9.8525 1.0363 1.0363 1.0622 1.0624 1.0656 1.0594 1.0594 1.0838 1.0985 1.0992 1.0975 1.0977 1.0966 1.1030 1.1022 1.0881 1.1064 1.1072 1.0925 1.0966 1.0943 1.0766 1.0775
irintensity: 1.0103 0.7770 0.3837 0.6863 0.5636 0.1133 1.5014 0.8003 0.6477 2.5058 0.9791 11.1705 2.0539 0.0219 4.4282 1.7411 0.8988 1.2966 1.0983 3.9712 0.9056 7.2197 5.5451 11.6377 1.4641 2.6512 2.3851 6.9104 1.6134 7.5873 11.2941 4.7617 9.4705 1.3533 5.7009 0.8893 4.8297 0.2280 11.1779 5.7730 20.5144 6.1982 2.0303 40.5986 18.3587 4.9040 56.0758 58.4393 7.5021 34.2834 0.8670 24.3107 4.7427 1.8605 12.8462 50.6771 4.6323 25.4962 3.7171 20.4004 6.5113 2.3125 4.2940 32.9767 24.3343 45.2673 7.5505 24.8781 46.3729 22.2434 6.6510 1.7315 15.6390 0.9405 111.4277 27.0709 34.3053 127.5406 70.0910 247.8423 85.4872 237.7913 31.3843 14.3628 14.5369 16.5693 66.5114 30.7155 22.9366 61.9508 222.2237 13.1836 24.6382 72.8973 55.7208 24.8164 50.5107 3.7738 3.9487 5.3002 17.1218 13.5047 19.6140 7.5013 9.7903 4.1487 0.4028 12.1272 23.2486 26.9976 25.7733 19.9388 12.9834 78.9272 26.1385 22.7437 8.8262 13.9544 14.4060 107.3191 108.7260 13.2385 48.8393 161.6636 89.6089 174.0472 37.3100 135.9660 316.4857 188.1469 24.4318 12.5155 25.3070 15.6600 15.3394 28.5261 17.8916 7.9203 3.6356 1.9574 30.6028 34.6467 12.6783 2.3155 4.0667 14.2680 26.8076 26.9082 0.9576 13.3720 3.4593 51.0339 24.2647
temp: 298.150 k
press: 1.00000 atm
elementType: 9 9 9 8 8 8 8 8 8 7 7 6 6 6 6 6 6 6 6 6 6 6 6 6 6 6 6 6 6 6 1 1 1 1 1 1 1 1 1 1 1 1 1 1 1 1 1 1 1 1 1 1 1
symmnumber: 1
zpe: 1062183.7 jmol-1
zpe.correction: 0.404564 hartree
zpe.thermalcorrener: 0.436193 hartree
zpe.thermalcorrenthalpy: 0.437137 hartree
zpe.thermalcorrgfe: 0.333534 hartree
zpe.sumelectzpe: -1595.973290 hartree
zpe.sumelectthermal: -1595.941662 hartree
zpe.sumelectthermalent: -1595.940717 hartree
zpe.sumelectthermalfe: -1596.044320 hartree
dipole: 1.8823 -5.4454 2.7689
dipole: 6.3924
quadrupole: -228.8101 -150.6233 -172.1637
quadrupole: 0.6449 9.9694 -2.1904
quadrupole: -44.9444 33.2424 11.7020 0.6449 9.9694 -2.1904
hfenergy: -1596.3778542 hartree
pointgroup: C01 [X(C19H23F3N2O6)]
dipole: -0.0917014 2.4504036 0.5586246 debye
polarizability: 273.157156|-3.7856748|237.8375387|37.8204838|26.4080979|231.3253697 unknown
InChI: InChI=1S/C19H23F3N2O6/c1-3-29-16(26)10-9-14(17(27)30-4-2)24-15(25)11-12-5-7-13(8-6-12)23-18(28)19(20,21)22/h5-8,14,23-24H,3-4,9-11H2,1-2H3
charge 0 multiplicity 1
53 atoms
F  5.169843 2.991728 3.424031
F  5.150382 0.980827 4.486989
F  6.637351 1.361365 2.822152
O  -4.237793 1.566542 0.920925
O  -0.608321 -2.785409 -1.622731
O  -5.777284 -0.147876 0.53478
O  -2.308162 -0.344658 -2.811126
O  -2.77947 -3.563968 -1.251331
O  4.324289 -0.222095 1.927006
N  -2.366892 0.466174 -0.625751
N  3.458739 1.972514 1.682893
C  -3.432496 -0.436103 -0.178928
C  -2.9516 -1.48936 0.874878
C  -1.644609 -2.204489 0.466484
C  -4.622275 0.315175 0.42593
C  -0.795854 1.506768 -2.228359
C  -1.883303 0.455152 -1.923869
C  0.307549 1.614388 -1.184924
C  -1.772097 -2.926439 -0.867732
C  1.067612 0.471588 -0.817059
C  0.622943 2.853024 -0.572429
C  2.414698 1.802002 0.72443
C  2.111776 0.550309 0.124345
C  1.663665 2.951942 0.372305
C  -5.299507 2.362697 1.618467
C  -0.634155 -3.389385 -2.996082
C  -5.391771 1.966388 3.09376
C  -0.2807 -4.877808 -2.948092
C  4.297896 1.007443 2.193724
C  5.313502 1.578076 3.228394
H  -3.791265 -0.977033 -1.07332
H  -2.789405 -0.99459 1.852324
H  -3.764052 -2.226861 0.998755
H  -0.797143 -1.502336 0.422442
H  -1.405083 -2.961198 1.239133
H  -2.026785 1.170427 0.032685
H  -0.380178 1.218953 -3.209809
H  -1.29066 2.487842 -2.363712
H  0.836596 -0.499165 -1.274039
H  0.056564 3.752506 -0.841046
H  2.688507 -0.336481 0.393691
H  1.893102 3.922493 0.830572
H  -6.256899 2.194603 1.095229
H  -4.969985 3.405463 1.485331
H  0.11563 -2.799365 -3.546664
H  -1.63563 -3.214174 -3.423673
H  -5.733884 0.923371 3.199086
H  -4.415926 2.078777 3.597375
H  -6.120911 2.619552 3.60796
H  3.598798 2.926855 2.030365
H  0.697027 -5.038741 -2.461242
H  -1.052635 -5.445928 -2.402977
H  -0.222538 -5.277185 -3.977846
