program: Gaussian 09
title: 000291307
version: EM64L-G09RevD.01
frameworkgroup: C1[X(C19H18N2O)]
method: RPBEPBE
basis: SDD
operation: Freq
keyword: #p
keyword: freq=noraman
keyword: PBEPBE/SDD
title: #p freq=noraman PBEPBE/SDD
converged: YES YES NO NO
title: Mulliken charges:
elementType: O N N C C C C C C C C C C C C C C C C C C C H H H H H H H H H H H H H H H H H H
charge: -0.198609 -0.101627 0.022759 -0.454324 -0.362385 0.318406 -0.296506 0.068578 -0.574542 -0.184066 -0.397680 0.470645 0.497304 -0.463251 -0.332631 -0.410129 -0.413691 -0.182324 -0.379526 -0.228430 -0.226196 -0.242065 0.237945 0.201614 0.201314 0.227005 0.235315 0.199594 0.216726 0.231387 0.228529 0.232388 0.244602 0.230328 0.236193 0.227746 0.241269 0.224423 0.225408 0.228506
chargesum: 0.00000
title: Mulliken charges with hydrogens summed into heavy atoms:
elementType: O N N C C C C C C C C C C C C C C C C C C C
charge: -0.198609 -0.101627 0.022759 -0.014765 0.065934 0.318406 0.138403 0.068578 -0.126429 -0.184066 -0.169151 0.470645 0.497304 -0.230863 -0.088029 -0.179801 -0.177498 0.045422 -0.138257 -0.004008 -0.000788 -0.013559
polarizability: 3.45953547e+02 9.57911555e+00 2.12806942e+02 2.65702801e+01 8.72490861e+00 1.21370994e+02
1716.lowfreq: -4.1605 -3.5590 0.0002 0.0007 0.0007 9.5633 16.4942 17.6673 30.0739
frequency: 16.4227 17.2287 30.0378 49.9966 76.4243 100.8606 112.5401 149.7532 173.2072 200.7011 233.8467 257.3218 296.0737 324.2313 336.2917 358.7846 385.0848 404.0674 426.4390 454.9051 481.2310 495.6644 506.0776 532.7434 539.2951 573.1553 589.7421 617.7553 633.4503 663.7456 672.8064 705.9447 750.8640 760.7304 773.3774 791.3407 807.0738 815.9085 844.3783 845.8336 854.1677 869.4685 918.2391 932.2787 935.2722 948.8499 975.0832 976.4409 985.2222 988.4620 989.9489 994.4290 1011.6745 1024.7818 1029.4346 1038.8479 1058.8951 1065.4485 1086.3440 1120.1512 1142.6801 1166.3227 1172.1604 1186.2591 1186.7864 1192.6458 1215.8506 1217.4653 1223.3195 1240.8096 1252.0930 1273.9903 1290.9469 1300.3838 1326.1897 1332.0636 1339.5844 1362.4552 1375.9298 1382.3373 1392.4111 1401.6057 1428.7592 1440.0938 1445.1306 1462.8376 1466.5188 1476.0204 1483.9156 1487.3801 1506.5286 1545.7131 1592.7692 1596.9537 1614.2141 1621.6407 2818.1585 2857.0606 2870.3246 2993.2457 3021.0864 3025.9464 3063.6778 3100.3120 3112.1357 3114.1762 3116.3502 3118.8029 3128.6904 3131.5375 3142.7418 3143.3500 3162.2007 3163.4600
redmass: 5.1137 4.0179 4.1589 3.8594 4.4438 3.5986 5.0952 3.6869 4.4900 2.8740 4.4464 3.7265 3.1673 2.4417 2.8479 3.9769 4.0427 2.8216 3.9135 5.3680 5.8961 3.4212 3.2524 5.8621 6.1819 3.9150 5.7233 6.3626 5.0965 5.1743 5.0169 1.7437 3.6307 2.1846 1.2639 1.2529 2.4217 3.8282 5.7690 2.1813 1.2480 3.6489 1.6189 4.8331 1.4378 1.3987 2.6775 1.4191 1.4639 2.0059 6.2448 1.3183 1.7158 2.7240 2.8590 2.5123 2.4798 2.8720 1.6814 1.8063 1.3290 1.6190 1.0544 1.1766 1.3797 1.1325 2.0074 2.1530 2.0033 2.4659 1.7065 1.5344 1.3561 1.5229 1.2966 1.5504 4.1828 1.5329 1.7973 7.5530 1.4301 2.3572 4.1214 2.1772 2.4154 1.1595 1.1131 1.1374 2.2600 1.1138 3.7662 7.3934 6.0522 6.1099 6.1867 7.3812 1.0713 1.0698 1.0708 1.0621 1.0850 1.0873 1.1023 1.0925 1.0876 1.0869 1.0868 1.0886 1.0907 1.0906 1.0970 1.0957 1.1015 1.0992
irintensity: 0.0166 0.2693 0.2584 0.6777 2.1372 1.9889 1.6839 1.6715 1.5001 1.5065 2.2120 4.7358 4.2679 4.1297 7.8125 0.5901 2.9655 0.0100 0.5610 2.1288 3.9695 0.6216 16.6705 0.5142 1.8730 5.8106 3.6546 0.0634 5.5973 4.0688 15.3235 53.5884 22.6320 23.0234 0.5706 2.5605 37.9735 1.3420 1.8490 57.5692 0.1729 31.1284 10.9933 95.7016 4.3200 1.6626 11.5398 1.0874 4.6275 15.4718 0.0266 0.5288 9.7698 13.3829 1.1169 8.5678 102.4323 71.5179 13.1019 105.9565 1.7268 17.2070 0.2820 10.5430 37.6497 6.9350 4.1521 26.4715 56.6631 18.7878 12.8355 4.5046 0.6253 10.5156 2.5561 44.9407 19.3748 28.7428 72.9926 1.0988 2.8547 27.5826 3.0009 5.4323 59.7919 9.6765 11.5329 0.4547 23.0116 13.6550 20.9744 32.5478 1.6139 5.3287 11.9843 4.3297 65.1225 50.1452 181.4233 24.0056 20.6039 18.0117 20.8361 27.0272 12.4016 6.7117 7.4664 18.0789 12.9913 10.0636 24.7335 44.0557 28.1403 36.5952
temp: 298.150 k
press: 1.00000 atm
elementType: 8 7 7 6 6 6 6 6 6 6 6 6 6 6 6 6 6 6 6 6 6 6 1 1 1 1 1 1 1 1 1 1 1 1 1 1 1 1 1 1
symmnumber: 1
zpe: 848360.5 jmol-1
zpe.correction: 0.323123 hartree
zpe.thermalcorrener: 0.341079 hartree
zpe.thermalcorrenthalpy: 0.342023 hartree
zpe.thermalcorrgfe: 0.274118 hartree
zpe.sumelectzpe: -917.976399 hartree
zpe.sumelectthermal: -917.958444 hartree
zpe.sumelectthermalent: -917.957499 hartree
zpe.sumelectthermalfe: -918.025405 hartree
dipole: 1.1661 2.9733 0.7794
dipole: 3.2875
quadrupole: -108.4684 -123.4457 -131.3399
quadrupole: -9.5239 6.5668 2.0886
quadrupole: 12.6163 -2.3611 -10.2552 -9.5239 6.5668 2.0886
hfenergy: -918.2995228 hartree
pointgroup: C01 [X(C19H18N2O1)]
dipole: -0.4653713 1.1176338 -0.4551949 debye
polarizability: 345.6883159|-4.8589741|209.0565016|29.1296164|-19.7251006|125.3866653 unknown
InChI: InChI=1S/C19H18N2O/c1-2-5-15(6-3-1)10-12-21-13-17-9-8-16-7-4-11-20-18(16)19(17)22-14-21/h1-9,11H,10,12-14H2
charge 0 multiplicity 1
40 atoms
O  1.451868 -1.514206 -0.378461
N  -0.651904 -0.314561 -0.353743
N  4.139422 -1.602894 0.198215
C  -0.040692 1.01318 -0.56217
C  -2.113022 -0.388811 -0.545868
C  1.467774 0.942279 -0.352453
C  0.122888 -1.358053 -1.012099
C  2.122849 -0.297986 -0.226956
C  -2.901358 0.354593 0.568674
C  3.538121 -0.362244 0.062867
C  2.225047 2.148168 -0.232793
C  4.272184 0.8818 0.192545
C  -4.399914 0.143303 0.416838
C  3.593273 2.131952 0.030213
C  5.673239 0.790647 0.479762
C  -5.169841 0.975759 -0.436581
C  -5.052405 -0.923828 1.087265
C  6.271266 -0.463004 0.619645
C  5.459226 -1.632453 0.468386
C  -6.553473 0.750367 -0.615993
C  -6.435975 -1.152832 0.912557
C  -7.19169 -0.316514 0.058202
H  -0.466763 1.724041 0.169248
H  -0.271175 1.4223 -1.582119
H  -2.42841 0.017573 -1.539763
H  -2.40735 -1.455081 -0.525872
H  -0.371193 -2.334006 -0.897633
H  0.318335 -1.149658 -2.094271
H  -2.668838 1.435738 0.526917
H  -2.542364 -0.023995 1.542692
H  1.700457 3.106291 -0.338584
H  4.156666 3.06729 0.123575
H  6.258512 1.711699 0.585888
H  -4.683381 1.811308 -0.956222
H  -4.47285 -1.572935 1.755879
H  7.338625 -0.566254 0.839223
H  5.906008 -2.629024 0.571343
H  -7.133268 1.406298 -1.275492
H  -6.92433 -1.977607 1.444082
H  -8.265065 -0.491036 -0.076545
