program: Gaussian 09
title: 000291347
version: EM64L-G09RevD.01
frameworkgroup: C1[X(C20H17N5O2)]
method: RPBEPBE
basis: SDD
operation: Freq
keyword: #p
keyword: freq=noraman
keyword: PBEPBE/SDD
title: #p freq=noraman PBEPBE/SDD
converged: YES YES NO NO
title: Mulliken charges:
elementType: O O N N N N N C C C C C C C C C C C C C C C C C C C C H H H H H H H H H H H H H H H H H
charge: -0.214793 -0.236384 -0.038150 -0.403708 -0.038012 -0.252915 0.020235 -0.630627 0.492126 0.008055 -0.382393 -0.428529 -0.216468 -0.219684 -0.246114 0.388128 0.152400 0.253143 -0.280070 -0.374611 -0.350477 -0.337908 -0.208352 -0.217892 -0.211316 -0.194936 -0.240851 0.217182 0.231050 0.243418 0.229562 0.224618 0.224087 0.227703 0.469219 0.292421 0.309025 0.277324 0.288464 0.238378 0.241526 0.233466 0.230055 0.232606
chargesum: 0.00000
title: Mulliken charges with hydrogens summed into heavy atoms:
elementType: O O N N N N N C C C C C C C C C C C C C C C C C C C C
charge: -0.214793 -0.236384 -0.038150 0.065512 -0.038012 -0.252915 0.020235 -0.182395 0.492126 0.008055 -0.138975 -0.198967 0.008151 0.004402 -0.018411 0.388128 0.152400 0.253143 0.012351 -0.065586 -0.073153 -0.049443 0.030026 0.023633 0.022150 0.035119 -0.008245
polarizability: 3.38485185e+02 -1.03925484e+01 5.27684945e+02 -2.86204441e+01 8.19696173e+00 1.53097197e+02
1716.lowfreq: -4.0921 -2.2326 -0.0002 0.0005 0.0008 5.5246 9.4901 20.1338 22.1256
frequency: 9.3029 19.0384 22.0275 26.4506 35.8725 45.1873 79.9143 89.3568 93.7241 104.3333 140.9205 162.2543 185.0749 211.1116 216.1183 248.7941 272.2781 283.0253 323.8590 343.8495 375.4148 388.4674 402.8488 404.9906 406.3790 425.5217 467.1893 479.1242 494.3636 536.8559 551.6136 552.4985 586.2281 610.8608 615.1616 623.6677 628.4667 659.1063 663.9205 690.7273 695.3970 708.6390 739.5339 761.2810 775.4757 783.9806 787.8378 813.5248 817.4906 853.8645 854.2740 858.8306 898.1886 909.8624 939.2719 940.2421 968.3737 977.3888 984.9336 988.0509 989.9499 991.5717 995.4736 1002.3834 1007.2442 1021.6487 1026.8432 1035.2732 1059.1651 1078.3234 1089.2668 1119.9013 1123.5644 1143.3038 1160.0465 1166.8288 1171.5579 1175.9786 1183.1728 1186.1864 1188.1989 1204.0301 1212.0558 1225.2306 1254.7183 1262.0461 1300.8606 1314.4111 1328.7233 1337.2211 1341.4514 1373.0577 1384.5251 1391.2488 1395.1597 1432.1515 1440.6097 1442.5349 1454.1990 1455.7315 1468.8547 1481.5013 1483.4775 1564.2947 1585.5024 1595.2940 1598.3145 1604.4135 1613.3405 2778.4381 3018.8934 3080.4270 3117.0214 3118.8351 3132.9154 3133.3124 3142.1428 3143.7686 3145.2719 3161.9981 3162.3673 3163.2365 3176.2014 3178.0824 3183.2928 3189.7480
redmass: 8.6392 5.1260 4.1501 8.6355 5.5852 4.2015 6.6615 5.8480 5.1516 5.4338 6.3445 5.5704 5.5079 5.3083 6.3531 5.8463 5.7789 6.0983 4.4910 3.9105 5.0819 4.8944 2.8290 8.9134 3.0396 3.9083 4.0102 4.7253 3.8528 3.7167 4.5893 6.3920 6.4155 6.3030 6.1857 6.2009 5.8764 5.6750 6.4703 2.6084 2.8527 1.5942 4.4053 2.7673 1.7194 1.4419 5.9590 3.6249 3.7332 1.2467 1.2565 6.0628 1.3978 1.5890 1.8814 1.4122 6.0379 1.3889 6.0670 1.3500 5.1235 1.4244 1.3213 1.3152 1.3353 2.1779 2.2130 2.4547 3.5941 1.6313 1.5622 1.1536 2.0722 1.6861 2.0181 1.3798 1.0569 1.3855 1.9230 1.1358 1.4714 2.6542 2.1896 2.5465 2.9021 2.0431 1.5630 2.3842 1.3637 1.7578 5.5835 6.3497 7.2220 4.8317 8.3490 2.4393 2.4407 2.2719 1.8793 1.3418 2.2407 2.3097 2.2266 6.6793 6.2008 6.1234 6.2184 5.7803 6.1338 1.0902 1.0596 1.1027 1.0852 1.0880 1.0914 1.0856 1.0875 1.0961 1.0903 1.1014 1.0953 1.0916 1.0967 1.0944 1.0965 1.0967
irintensity: 1.9981 0.0811 0.2514 0.5547 0.1464 0.1903 1.3939 0.7781 0.4694 1.7053 0.1176 0.6246 3.1996 1.5352 1.1239 1.0356 0.2552 4.0406 0.0957 1.8615 0.9206 1.6831 0.0257 11.3557 0.3775 2.1503 4.4473 1.7594 22.4211 2.2371 1.6271 1.1023 19.7222 0.8209 0.7872 13.7926 7.6537 17.2970 11.5273 21.5218 24.4816 95.3765 11.1728 18.2830 73.1600 46.4683 17.9481 4.2564 3.9444 0.0818 0.5375 0.0919 0.3990 2.5053 4.8037 6.5105 16.4977 0.9339 0.4692 3.8240 0.2908 0.2030 0.4955 0.7520 0.7652 6.4295 8.9524 17.1787 0.8938 9.7613 23.5066 81.3619 45.5497 12.2223 157.8464 41.3855 0.0376 34.2833 262.9159 5.5814 1.5148 11.9064 128.6612 269.9868 133.4903 13.9682 5.8677 63.4649 2.2161 28.5483 116.9025 130.1127 2.7958 20.4631 38.9932 69.3171 9.8927 6.8569 91.5268 29.4213 6.3935 34.8327 17.9906 38.9441 2.4236 2.4675 22.1730 2.2343 12.2206 19.2249 21.8750 2.2372 8.1678 1.1887 11.9903 1.8753 8.4078 39.2281 19.4125 31.9503 27.1365 12.4930 16.6910 8.7847 18.7555 10.9579
temp: 298.150 k
press: 1.00000 atm
elementType: 8 8 7 7 7 7 7 6 6 6 6 6 6 6 6 6 6 6 6 6 6 6 6 6 6 6 6 1 1 1 1 1 1 1 1 1 1 1 1 1 1 1 1 1
symmnumber: 1
zpe: 873388.4 jmol-1
zpe.correction: 0.332656 hartree
zpe.thermalcorrener: 0.355332 hartree
zpe.thermalcorrenthalpy: 0.356276 hartree
zpe.thermalcorrgfe: 0.275801 hartree
zpe.sumelectzpe: -1194.511906 hartree
zpe.sumelectthermal: -1194.489230 hartree
zpe.sumelectthermalent: -1194.488286 hartree
zpe.sumelectthermalfe: -1194.568761 hartree
dipole: 1.8119 -1.2779 -0.6456
dipole: 2.3093
quadrupole: -161.7162 -119.9617 -156.5533
quadrupole: -4.2503 2.0028 3.5931
quadrupole: -15.6391 26.1154 -10.4763 -4.2503 2.0028 3.5931
hfenergy: -1194.8445625 hartree
pointgroup: C01 [X(C20H17N5O2)]
dipole: 0.6125602 0.5563261 -0.3751091 debye
polarizability: 517.3853155|-36.5825555|335.7425694|-46.3443336|-41.6287808|166.1394429 unknown
InChI: InChI=1S/C20H17N5O2/c26-25(27)19-14-8-7-13-18(19)22-24-20(15-16-9-3-1-4-10-16)23-21-17-11-5-2-6-12-17/h1-14,21H,15H2
charge 0 multiplicity 1
44 atoms
O  0.7507 -4.867246 1.287293
O  -0.472017 -3.053106 0.697279
N  -1.483765 0.680882 -0.896799
N  -1.751248 -0.48206 -0.274051
N  0.930786 0.192044 -1.140353
N  0.74121 -0.987089 -0.511081
N  0.658248 -3.685733 0.763334
C  -0.000256 2.321562 -1.932969
C  0.540886 3.376614 -0.964131
C  -0.203248 0.964196 -1.278944
C  -0.222714 3.773145 0.164353
C  1.80644 3.976256 -1.175863
C  0.268157 4.74965 1.058303
C  2.300785 4.955435 -0.282683
C  1.532727 5.345468 0.837652
C  -3.091846 -0.766809 0.090715
C  1.915738 -1.761597 -0.381089
C  1.884922 -3.061532 0.235505
C  3.187361 -1.291651 -0.841533
C  -3.368769 -1.990076 0.760512
C  -4.140887 0.148028 -0.203291
C  3.068236 -3.833313 0.371531
C  4.350322 -2.059136 -0.703401
C  4.296438 -3.341362 -0.093195
C  -4.694983 -2.287079 1.132554
C  -5.458777 -0.166954 0.176036
C  -5.745234 -1.382993 0.84543
H  0.699035 2.203263 -2.778524
H  -0.974951 2.646299 -2.338235
H  -1.202343 3.311435 0.34022
H  2.407415 3.674483 -2.042445
H  -0.33293 5.047169 1.925267
H  3.281538 5.411273 -0.460838
H  1.913758 6.103568 1.531182
H  -0.922052 -1.137943 -0.103317
H  3.208421 -0.30125 -1.303566
H  -2.558558 -2.690514 0.979286
H  -3.902139 1.079741 -0.721889
H  2.988145 -4.813965 0.846442
H  5.306099 -1.666005 -1.066617
H  5.203401 -3.943596 0.017258
H  -4.907828 -3.229574 1.648331
H  -6.267773 0.536233 -0.050504
H  -6.773455 -1.621764 1.137736
