program: Gaussian 09
title: 000291308
version: EM64L-G09RevD.01
frameworkgroup: C1[X(C18H14Cl2N2O)]
method: RPBEPBE
basis: SDD
operation: Freq
keyword: #p
keyword: freq=noraman
keyword: PBEPBE/SDD
title: #p freq=noraman PBEPBE/SDD
converged: YES YES NO NO
title: Mulliken charges:
elementType: Cl Cl O N N C C C C C C C C C C C C C C C C C C H H H H H H H H H H H H H H
charge: -0.012933 -0.008644 -0.196920 -0.130901 0.022238 -0.466167 0.319538 -0.294933 -0.491919 0.071133 -0.182339 -0.394892 0.497165 0.471037 -0.459636 -0.338957 -0.455665 -0.330528 -0.181058 -0.080438 -0.189957 -0.377684 -0.113934 0.211773 0.253923 0.202621 0.232879 0.205947 0.229660 0.231139 0.233906 0.306286 0.242607 0.245725 0.228911 0.258760 0.242256
chargesum: 0.00000
title: Mulliken charges with hydrogens summed into heavy atoms:
elementType: Cl Cl O N N C C C C C C C C C C C C C C C C C C
charge: -0.012933 -0.008644 -0.196920 -0.130901 0.022238 -0.000471 0.319538 0.140567 -0.056313 0.071133 -0.182339 -0.163753 0.497165 0.471037 -0.225730 -0.032671 -0.213058 -0.084803 0.047854 -0.080438 0.068803 -0.135428 -0.113934
polarizability: 3.12539368e+02 3.26707849e+01 2.11498412e+02 3.98671916e+01 -1.87005524e+00 1.78871959e+02
1716.lowfreq: -10.8310 -5.7293 -2.0315 -0.0026 -0.0025 -0.0018 11.8954 20.9857 24.3387
frequency: 11.2575 20.8715 24.2455 67.6557 89.4199 111.3857 130.5344 151.9012 172.6332 177.5271 188.2707 224.1210 238.0810 289.7009 298.8639 300.0149 326.1759 352.2643 408.3014 419.1560 425.5860 440.7473 445.1796 464.7610 482.8242 497.4464 533.8920 541.2388 570.0642 577.7659 625.7327 651.5211 662.8095 672.1338 674.0179 701.4013 754.5214 774.7572 807.6288 814.4399 841.9058 846.6846 859.9416 871.3296 908.5618 936.5072 940.7141 950.9451 955.2963 969.7932 986.4105 989.4266 994.5138 1003.6324 1036.7173 1058.1160 1067.7284 1109.4400 1130.1716 1142.5021 1146.3514 1168.7709 1193.0067 1196.9382 1200.7124 1218.2815 1229.7818 1245.5584 1248.1275 1272.7385 1296.5009 1319.1948 1337.6523 1352.5689 1373.2575 1377.9260 1383.6446 1398.4531 1403.6191 1428.6993 1444.7903 1452.2452 1462.0805 1468.2759 1479.5739 1506.2054 1545.1453 1573.4760 1596.2721 1597.1560 1622.5937 2834.6206 2864.6961 2877.5393 2995.3078 3021.8472 3096.5506 3118.0718 3120.3136 3129.7908 3132.3136 3144.8158 3155.1372 3164.1739 3170.4077
redmass: 7.8008 8.4005 7.2409 7.5412 5.2112 4.4222 4.7064 5.1029 4.8083 5.9724 12.4864 4.0060 4.3450 6.6170 3.0643 3.8466 2.7852 4.1721 6.8652 5.5966 3.9249 4.7523 3.7403 6.7027 5.5380 3.4566 6.1171 4.9065 4.6796 4.8800 5.7551 6.0247 5.4195 4.8738 6.5641 3.9100 5.0224 1.2657 2.4861 1.3667 5.5678 2.1157 5.1476 4.4030 1.3808 1.4026 6.5142 1.4138 1.3609 2.3002 1.3960 3.0116 1.7272 5.2978 2.3632 2.4158 3.1260 1.8347 2.1892 1.3565 1.5713 1.5737 1.6177 1.1968 1.9970 2.0795 1.9418 1.5978 1.5672 1.9712 1.6480 1.6934 5.1416 2.1235 2.8764 2.1668 2.0743 2.1566 1.8529 4.0472 2.4837 1.7735 1.4394 1.1379 1.1399 3.7907 7.3642 7.5797 6.1284 6.6131 7.3697 1.0713 1.0697 1.0708 1.0872 1.0860 1.0929 1.0867 1.0886 1.0908 1.0899 1.0974 1.0921 1.0992 1.0953
irintensity: 0.1714 0.2618 1.5229 2.9893 0.0953 0.4893 1.9948 0.7791 1.9531 0.6102 1.0068 1.0221 4.5332 0.8790 2.2274 3.6772 13.4048 3.4949 0.6601 9.0848 0.3761 12.5186 5.4706 6.2169 4.3611 0.2145 1.0790 4.7169 4.6886 3.5019 2.3459 13.8743 7.6755 11.1295 15.8875 3.9755 5.4898 0.2034 34.9408 37.3148 8.4919 59.7590 37.7336 35.4669 24.0484 0.5951 65.2315 1.9479 1.8342 6.6826 1.3697 41.5195 1.9448 50.2418 6.4640 71.9063 82.2092 26.7821 67.0296 4.8902 24.9841 12.2401 15.1040 4.1482 42.7042 67.1148 26.5410 3.2585 9.8406 3.3039 21.6014 32.9284 10.8366 51.4440 39.3767 55.9525 9.0548 36.9435 1.9692 1.9916 54.8907 72.2974 15.6607 8.5463 12.5737 20.0232 28.8360 11.0833 4.4559 2.6918 3.8470 60.8316 41.0037 198.8374 14.5189 14.2660 26.5813 4.8624 17.5849 12.6121 8.5150 24.2221 3.5774 36.3215 4.4248
temp: 298.150 k
press: 1.00000 atm
elementType: 17 17 8 7 7 6 6 6 6 6 6 6 6 6 6 6 6 6 6 6 6 6 6 1 1 1 1 1 1 1 1 1 1 1 1 1 1
symmnumber: 1
zpe: 724257.3 jmol-1
zpe.correction: 0.275855 hartree
zpe.thermalcorrener: 0.294922 hartree
zpe.thermalcorrenthalpy: 0.295866 hartree
zpe.thermalcorrgfe: 0.225356 hartree
zpe.sumelectzpe: -1797.529499 hartree
zpe.sumelectthermal: -1797.510432 hartree
zpe.sumelectthermalent: -1797.509488 hartree
zpe.sumelectthermalfe: -1797.579998 hartree
dipole: -0.6816 3.1983 3.4182
dipole: 4.7305
quadrupole: -145.5949 -135.9435 -145.3930
quadrupole: 22.8057 -4.0796 -0.9808
quadrupole: -3.2845 6.3670 -3.0825 22.8057 -4.0796 -0.9808
hfenergy: -1797.8053542 hartree
pointgroup: C01 [X(C18H14Cl2N2O1)]
dipole: 0.1431708 -0.5183638 1.781729 debye
polarizability: 318.5671849|5.4061493|205.330512|-43.6650419|-9.0952339|179.0120406 unknown
InChI: InChI=1S/C18H14Cl2N2O/c19-15-6-3-12(8-16(15)20)9-22-10-14-5-4-13-2-1-7-21-17(13)18(14)23-11-22/h1-8H,9-11H2
charge 0 multiplicity 1
37 atoms
Cl -3.578966 2.03382 -2.418698
Cl -6.47158 1.86506 -0.856399
O  1.64063 -1.751292 -0.5548
N  -0.567897 -1.485767 0.386362
N  4.077273 -0.674639 -1.230321
C  -0.167151 -0.47295 1.382667
C  1.224872 0.056907 1.060249
C  0.509759 -2.426519 0.114775
C  -1.91392 -2.051432 0.554742
C  2.033277 -0.575521 0.096382
C  3.321817 -0.029334 -0.265115
C  1.706883 1.232442 1.714818
C  -3.023149 -1.050709 0.23059
C  3.772986 1.172569 0.409133
C  2.948296 1.784451 1.407026
C  -2.832325 -0.081406 -0.782194
C  -4.26732 -1.1103 0.902562
C  5.053586 1.694578 0.033256
C  5.806895 1.042239 -0.944297
C  -3.87182 0.806451 -1.117409
C  -5.312046 -0.224483 0.562701
C  5.273958 -0.142375 -1.546545
C  -5.114341 0.736457 -0.450101
H  -0.193622 -0.883846 2.425765
H  -0.893565 0.360055 1.351146
H  0.927526 -2.895446 1.039804
H  0.175415 -3.204571 -0.587877
H  -2.084653 -2.450043 1.585629
H  -2.000417 -2.915466 -0.134726
H  1.066323 1.711104 2.466048
H  3.299114 2.690148 1.914489
H  -1.86532 -0.02789 -1.29269
H  -4.428482 -1.84874 1.696507
H  5.425189 2.603125 0.521526
H  6.788111 1.4157 -1.253707
H  -6.275221 -0.267561 1.079318
H  5.848084 -0.674514 -2.314916
