program: Gaussian 09
title: 000291364
version: EM64L-G09RevD.01
frameworkgroup: C1[X(C29H24N2O3)]
method: RPBEPBE
basis: SDD
operation: Freq
keyword: #p
keyword: freq=noraman
keyword: PBEPBE/SDD
title: #p freq=noraman PBEPBE/SDD
converged: YES YES NO NO
title: Mulliken charges:
elementType: O O O N N C C C C C C C C C C C C C C C C C C C C C C C C C C C C C H H H H H H H H H H H H H H H H H H H H H H H H
charge: -0.326906 -0.326917 -0.440945 -0.486870 -0.487166 0.085536 0.087167 0.271503 0.270097 0.290759 0.289638 -0.147242 -0.146499 -0.408922 -0.408567 -0.393494 -0.393057 0.429497 0.428717 -0.231971 -0.231897 0.474754 -0.392552 -0.433592 -0.397645 -0.411117 -0.551092 -0.428645 -0.383207 0.444213 -0.333535 -0.418830 -0.335226 -0.808023 0.275734 0.275215 0.377849 0.377931 0.292322 0.292377 0.234674 0.234695 0.265555 0.249336 0.288490 0.229742 0.216721 0.211242 0.249502 0.265171 0.231340 0.231739 0.228240 0.201128 0.224686 0.229935 0.233324 0.335084
chargesum: 0.00000
title: Mulliken charges with hydrogens summed into heavy atoms:
elementType: O O O N N C C C C C C C C C C C C C C C C C C C C C C C C C C C C C
charge: -0.326906 -0.326917 -0.105861 -0.109021 -0.109235 0.085536 0.087167 0.271503 0.270097 0.290759 0.289638 -0.147242 -0.146499 -0.133188 -0.133352 -0.101172 -0.100679 0.429497 0.428717 0.002702 0.002798 0.474754 -0.126997 -0.184256 -0.109154 -0.181375 -0.123129 -0.179143 -0.118036 0.444213 -0.102194 -0.187091 0.094143 -0.120077
polarizability: 5.90816450e+02 -1.32705061e+01 6.02574460e+02 -4.69025010e+01 5.08274501e+00 1.88097261e+02
1716.lowfreq: -5.5042 -2.7082 -0.0008 -0.0007 -0.0002 2.8673 19.0315 21.9366 26.1552
frequency: 18.9784 21.9258 26.1257 30.1236 31.3217 36.2703 51.4538 64.1823 74.7894 84.6679 111.0520 120.5058 130.2467 152.9373 159.0153 168.1333 183.2887 192.7372 216.0642 235.5158 257.8838 271.4917 287.4478 319.0384 324.2754 340.8405 348.2136 364.8185 384.1880 396.4488 409.1475 411.6345 415.0395 425.4661 429.5833 433.0736 436.3281 470.1578 474.6087 499.5480 504.7163 512.4029 537.5084 560.5246 567.1077 611.6327 625.5336 632.6602 637.5740 661.4714 676.8098 692.9753 710.6886 722.9913 724.5269 725.1716 739.9708 761.7591 775.4292 803.9874 806.8853 816.4710 822.4090 831.1349 837.2458 841.5676 845.8414 848.8087 865.2705 871.9663 891.8302 917.9714 924.5108 930.2470 947.8323 952.0742 955.6796 966.4153 967.5304 974.8276 986.2266 989.2936 995.7551 1002.9806 1008.9500 1010.0762 1011.9414 1023.7602 1046.3957 1050.8873 1071.0072 1086.7863 1120.6733 1126.4258 1134.7967 1163.8823 1166.4280 1186.8165 1193.0776 1197.0660 1214.7461 1224.6897 1234.8123 1239.0627 1245.5604 1249.7081 1264.8366 1298.0988 1310.6613 1314.2949 1321.9035 1325.5399 1327.6438 1341.4274 1361.0235 1372.0080 1376.4723 1380.6954 1383.0723 1385.8921 1399.2736 1404.2098 1418.4800 1421.6662 1447.5072 1454.2496 1454.7480 1468.3476 1470.3525 1474.4739 1476.3590 1499.0526 1506.5636 1509.7485 1520.1456 1560.8069 1570.9649 1577.0750 1607.1114 1609.0515 1609.7020 1618.1343 1624.5093 1636.3664 2936.2495 2941.4497 2944.8663 2964.9387 2975.6084 3016.1752 3053.1338 3083.6267 3088.1384 3117.6236 3121.6556 3124.4928 3132.8232 3138.8569 3147.0055 3147.9192 3150.6874 3156.0123 3158.4268 3164.5294 3165.4062 3172.5536 3183.3882 3556.7669
redmass: 6.0551 5.2460 4.1137 1.7776 1.6329 4.4943 4.6647 4.0927 5.1730 5.2127 4.7264 4.7461 4.7275 5.1444 5.5321 3.9780 5.6804 6.3277 3.9929 5.6780 5.4095 3.8068 4.5058 2.3179 1.5243 3.7287 3.7026 5.1481 5.3751 5.1106 4.2465 3.1635 3.3333 6.0662 4.3470 4.5187 11.3535 3.3916 9.6492 4.2800 3.2766 3.7043 4.7849 3.0396 3.6063 6.1636 5.9891 6.8037 6.8526 4.9823 5.9681 6.3192 3.4488 4.3745 2.7811 3.5634 4.2436 4.3191 4.1742 1.8095 3.2489 2.7500 1.6344 1.9429 1.8503 1.4645 1.8650 3.0855 1.4631 4.5687 3.9192 1.2901 1.3867 1.6649 1.3715 1.6931 1.5639 2.4003 1.8592 1.6228 1.4386 1.4180 1.3857 1.3795 2.7757 2.7590 1.3570 2.4580 1.5408 2.7845 2.6132 2.4902 1.3921 1.2933 1.1795 2.3404 1.1003 1.2351 1.1285 1.3574 2.0926 2.8008 1.2823 2.9078 1.6500 2.5391 1.8881 2.2882 1.4382 1.6201 1.8007 1.7976 2.8083 1.9230 4.5385 2.8818 2.9581 2.2359 3.0852 2.9319 1.2430 9.0655 3.3089 3.1133 1.1038 3.1686 4.4429 1.0925 1.0476 1.3111 2.3973 6.2823 2.8811 2.9425 4.2375 3.8318 5.5957 6.1222 2.6343 2.8175 3.8999 5.9284 4.6313 4.4871 1.0854 1.0662 1.0841 1.0701 1.0374 1.0919 1.0975 1.0988 1.0960 1.0882 1.0882 1.0886 1.0862 1.0886 1.0959 1.0962 1.0909 1.0945 1.0959 1.0889 1.0942 1.0992 1.0964 1.0661
irintensity: 0.2775 0.2460 0.8638 0.9136 0.4268 0.7878 1.3521 0.0712 1.5832 0.9712 3.3517 4.1720 1.0816 0.2948 7.0301 0.7110 1.4686 0.3686 2.4491 0.4318 10.0039 7.2984 3.9938 68.9283 146.0817 15.7991 2.6759 13.0956 2.3701 0.7976 1.5267 0.6300 0.5165 0.4013 2.2761 4.8194 11.0945 2.9415 19.8421 7.8738 30.3096 4.7201 11.8050 51.5135 28.9428 1.9603 0.2565 1.1517 1.9849 0.4312 10.0524 1.3613 3.6734 3.7408 22.3938 0.7355 3.5585 6.8648 20.9678 45.6228 1.0791 22.8344 27.0303 31.0389 8.1082 0.8583 26.3942 0.0843 4.0844 10.6959 43.6299 10.4827 175.1489 3.8156 5.7069 19.9969 6.7612 4.6390 5.0240 41.6660 16.2300 6.3933 5.8728 10.7500 17.2349 11.6255 0.1004 33.2213 12.1839 11.2421 11.2539 6.8901 18.6393 15.7193 14.8291 9.1468 0.5287 36.5338 6.9645 14.8189 5.8940 3.5422 8.6968 25.6382 4.6704 3.2026 31.1189 24.9880 88.3761 0.7147 59.7630 205.1750 678.8894 24.8617 0.8710 0.8618 8.6525 23.2856 13.1604 2.1508 6.1724 18.3227 1.2341 2.7241 14.5948 29.0006 10.9250 6.7437 12.2947 8.6363 1.9083 341.2203 35.4069 147.0702 850.3291 49.9853 7.3712 12.4918 103.4855 106.3370 35.5384 59.7000 5.1710 116.8732 79.9923 36.4296 7.2355 141.9871 59.1474 39.2741 20.3783 18.1408 26.0552 29.8022 14.8098 40.9388 3.9675 3.1790 13.6333 16.9284 20.7377 4.7394 5.7856 2.2101 1.8067 40.1423 4.0411 4.3989
temp: 298.150 k
press: 1.00000 atm
elementType: 8 8 8 7 7 6 6 6 6 6 6 6 6 6 6 6 6 6 6 6 6 6 6 6 6 6 6 6 6 6 6 6 6 6 1 1 1 1 1 1 1 1 1 1 1 1 1 1 1 1 1 1 1 1 1 1 1 1
symmnumber: 1
zpe: 1193497.1 jmol-1
zpe.correction: 0.454579 hartree
zpe.thermalcorrener: 0.483428 hartree
zpe.thermalcorrenthalpy: 0.484373 hartree
zpe.thermalcorrgfe: 0.391883 hartree
zpe.sumelectzpe: -1452.365846 hartree
zpe.sumelectthermal: -1452.336996 hartree
zpe.sumelectthermalent: -1452.336052 hartree
zpe.sumelectthermalfe: -1452.428542 hartree
dipole: 2.2973 -3.7016 -1.7044
dipole: 4.6781
quadrupole: -162.5450 -170.2369 -203.0179
quadrupole: -1.7366 -16.0838 6.1576
quadrupole: 16.0549 8.3631 -24.4180 -1.7366 -16.0838 6.1576
hfenergy: -1452.8204248 hartree
pointgroup: C01 [X(C29H24N2O3)]
dipole: 0.7225696 -1.5898984 -0.5810068 debye
polarizability: 587.1754526|-14.4102676|605.2473537|-48.2501217|-14.622988|189.0653646 unknown
InChI: InChI=1S/C29H24N2O3/c1-18-6-10-20(11-7-18)30-24-14-15-25(31-21-12-8-19(9-13-21)16-17-32)27-26(24)28(33)22-4-2-3-5-23(22)29(27)34/h2-15,30-32H,16-17H2,1H3
charge 0 multiplicity 1
58 atoms
O  1.630701 3.161649 -0.626138
O  -3.664907 1.887129 0.402474
O  6.819269 -3.957551 1.750125
N  2.30217 0.70315 -0.51489
N  -3.147849 -0.607978 0.269366
C  -0.016485 1.425597 -0.224861
C  -1.410294 1.090309 -0.011005
C  0.973077 0.377844 -0.308251
C  -1.816491 -0.293179 0.061662
C  -0.622047 3.889681 -0.225186
C  -1.98549 3.561387 0.026888
C  0.396297 2.825743 -0.366998
C  -2.41209 2.149741 0.146858
C  0.532529 -0.988876 -0.213258
C  -0.80387 -1.310237 -0.043113
C  -0.236122 5.251236 -0.338915
C  -2.944696 4.599045 0.164172
C  3.450545 -0.127135 -0.432162
C  -3.791179 -1.87145 0.195336
C  -1.193216 6.272462 -0.201768
C  -2.553171 5.944985 0.050718
C  5.878026 -1.650027 -0.289194
C  3.598175 -1.172499 0.520443
C  4.543241 0.166044 -1.292335
C  4.787586 -1.926744 0.577934
C  5.733959 -0.581726 -1.213078
C  7.172915 -2.454465 -0.250863
C  -4.880044 -2.112937 1.078534
C  -3.46078 -2.866518 -0.763514
C  -5.25802 -4.336335 0.081039
C  -5.597277 -3.321935 1.016326
C  -4.182439 -4.078744 -0.805437
C  7.651788 -2.896057 1.149718
C  -6.037675 -5.638233 0.025305
H  1.265865 -1.793362 -0.305847
H  -1.09196 -2.360367 0.044385
H  2.422184 1.738607 -0.685973
H  -3.724868 0.259177 0.446485
H  0.817792 5.471626 -0.532826
H  -3.983446 4.315773 0.358294
H  -0.89125 7.321868 -0.288578
H  -3.296362 6.742739 0.156761
H  2.804262 -1.36666 1.248521
H  4.44667 0.97893 -2.020828
H  4.892769 -2.72402 1.321249
H  6.564794 -0.332132 -1.88487
H  7.077716 -3.362629 -0.886649
H  7.980209 -1.851039 -0.711953
H  -5.146278 -1.34808 1.816725
H  -2.678262 -2.677547 -1.505003
H  -6.430863 -3.486569 1.710083
H  -3.913952 -4.831125 -1.55682
H  7.588754 -2.061384 1.866828
H  8.708391 -3.233411 1.092254
H  -5.602748 -6.339329 -0.707451
H  -6.050242 -6.143343 1.009287
H  -7.091968 -5.464025 -0.262646
H  6.868859 -4.762677 1.174537
