program: Gaussian 09
title: 000291295
version: EM64L-G09RevD.01
frameworkgroup: C1[X(C13H16N4O2Si)]
method: RPBEPBE
basis: SDD
operation: Freq
keyword: #p
keyword: freq=noraman
keyword: PBEPBE/SDD
title: #p freq=noraman PBEPBE/SDD
converged: NO YES NO NO
title: Mulliken charges:
elementType: Si O O N N N N C C C C C C C C C C C C C H H H H H H H H H H H H H H H H
charge: 1.424112 -0.209026 -0.163630 -0.546681 -0.316074 -0.072828 0.027660 -0.231799 -0.412170 0.188392 0.192970 -1.056788 -1.022049 -1.020691 0.490958 -0.337866 -0.346434 -0.221851 -0.219935 -0.238591 0.294892 0.299553 0.281216 0.247764 0.235369 0.270248 0.250422 0.233142 0.232232 0.270101 0.242254 0.270719 0.265828 0.233725 0.231532 0.233325
chargesum: 0.00000
title: Mulliken charges with hydrogens summed into heavy atoms:
elementType: Si O O N N N N C C C C C C C C C C C C C
charge: 1.424112 -0.209026 -0.163630 -0.546681 -0.316074 -0.072828 0.027660 0.063093 -0.112617 0.188392 0.192970 -0.292440 -0.268236 -0.276103 0.490958 -0.067147 -0.080606 0.011874 0.011596 -0.005266
polarizability: 2.49308227e+02 -4.77673806e+00 1.92247875e+02 1.23741104e+01 1.45282521e+01 1.44543062e+02
1716.lowfreq: -14.6170 -10.7234 -2.1977 -0.0020 -0.0015 -0.0007 26.5199 30.6122 45.6404
frequency: 26.3002 30.3113 45.5417 55.3565 71.6392 103.1359 108.2936 123.3779 148.9422 157.2345 159.0771 172.9631 187.6414 191.2974 198.4221 222.0850 272.3755 276.9944 287.1171 318.0326 359.6887 391.9802 404.1657 426.1428 492.7123 523.7605 565.2824 587.9442 598.3459 611.2394 614.9498 648.9576 691.1202 706.4230 713.2690 718.8033 732.3697 755.1455 765.5103 782.3739 816.9586 822.3293 838.0148 848.2963 879.1054 912.8579 916.9335 919.4399 921.2460 933.8051 972.0540 982.4571 983.5675 990.6586 995.5199 1016.7145 1030.1627 1082.2955 1092.5711 1134.4870 1158.7657 1176.5456 1188.9191 1197.3442 1235.0187 1240.2021 1265.9587 1302.1560 1303.1078 1315.4386 1325.1396 1331.4621 1360.3536 1384.7320 1437.2180 1444.4659 1446.3532 1448.3798 1452.1711 1456.9865 1468.3642 1485.7679 1595.2680 1609.7981 1629.7906 1697.3700 2984.8108 2986.7277 2990.1905 3062.2530 3085.4629 3088.6556 3091.8963 3092.9468 3097.2946 3101.9730 3102.7613 3134.5331 3147.7684 3163.8986 3184.6673 3189.0811
redmass: 4.6196 3.4836 4.3685 6.4946 6.8063 4.5959 3.1950 1.1090 3.3808 5.5545 1.0816 1.1764 2.4745 2.6674 3.6066 3.5218 5.3255 4.8091 8.1016 7.5668 6.3911 6.4003 2.8318 9.3913 4.3495 4.9848 8.5179 8.0737 6.6974 5.6592 5.8680 6.5478 2.0678 2.9490 2.9577 4.6195 7.5421 1.1738 2.1929 4.2257 1.4406 1.3713 1.2857 5.9540 4.3290 2.0898 1.4630 1.6297 1.6460 2.4277 1.3953 2.8130 3.6342 5.9074 1.3399 4.4133 2.1629 4.6920 1.7973 4.8657 4.4483 1.0509 1.4010 1.1508 2.1011 1.4475 1.4445 1.2047 1.2051 1.2120 4.4459 1.3905 7.3075 9.2514 1.0521 2.2930 1.0512 1.0532 1.0492 1.0494 1.0478 2.2729 6.3958 5.9369 12.0456 12.5906 1.0345 1.0345 1.0345 1.0870 1.0973 1.0978 1.0882 1.0980 1.0994 1.0991 1.0985 1.0857 1.0906 1.0966 1.0952 1.0974
irintensity: 0.7377 0.1586 0.4090 3.2252 1.0429 1.9822 1.0139 0.0824 0.9952 4.0721 0.5457 0.3929 2.1325 0.5851 1.9929 7.2157 2.5415 4.3535 4.9603 6.0115 30.7182 2.1756 0.2574 8.6433 5.2301 8.1561 11.4417 28.6967 5.6770 9.2993 10.0402 2.5725 26.6290 8.4467 9.5126 57.7017 0.9201 0.0914 18.3994 74.9398 10.3103 22.0390 0.8744 18.3149 111.5733 118.5143 6.0866 84.7721 78.0308 116.9537 0.0609 22.8591 38.6093 0.3128 0.0288 3.1348 9.2489 110.7329 2.8529 217.5996 52.7422 0.1696 16.0192 0.4262 2.3667 4.2977 1.6843 57.8357 49.3872 50.2984 211.8045 15.4015 60.2229 0.9569 0.8308 14.8993 6.5815 2.1567 8.9774 4.2484 22.5134 75.0563 13.9677 14.9382 495.1107 41.7985 11.0101 7.5433 12.0145 4.4564 8.3975 11.6311 4.9509 24.9583 5.3882 6.0483 9.0805 0.1030 15.7462 30.6970 3.0367 1.3152
temp: 298.150 k
press: 1.00000 atm
elementType: 14 8 8 7 7 7 7 6 6 6 6 6 6 6 6 6 6 6 6 6 1 1 1 1 1 1 1 1 1 1 1 1 1 1 1 1
symmnumber: 1
zpe: 716549.9 jmol-1
zpe.correction: 0.272919 hartree
zpe.thermalcorrener: 0.293219 hartree
zpe.thermalcorrenthalpy: 0.294163 hartree
zpe.thermalcorrgfe: 0.222861 hartree
zpe.sumelectzpe: -1162.385352 hartree
zpe.sumelectthermal: -1162.365053 hartree
zpe.sumelectthermalent: -1162.364108 hartree
zpe.sumelectthermalfe: -1162.435410 hartree
dipole: -1.2707 -3.4487 -1.9580
dipole: 4.1644
quadrupole: -108.4353 -138.5054 -119.8203
quadrupole: -2.6249 7.3012 -4.6457
quadrupole: 13.8184 -16.2517 2.4334 -2.6249 7.3012 -4.6457
hfenergy: -1162.6582711 hartree
pointgroup: C01 [X(C13H16N4O2Si1)]
dipole: 0.4710723 -1.3812307 0.7447465 debye
polarizability: 250.1037091|2.2852075|192.2823949|9.2209734|-14.5296388|143.7130601 unknown
InChI: InChI=1S/C13H16N4O2Si/c1-20(2,3)17-11-10(14-15-17)12(18)16(13(11)19)9-7-5-4-6-8-9/h4-8,10-11H,1-3H3
charge 0 multiplicity 1
36 atoms
Si 3.587934 -1.020662 -0.352537
O  0.242215 -1.671647 0.821719
O  -1.497372 2.695709 0.461764
N  2.446118 0.384794 0.004235
N  -0.939465 0.372677 0.483494
N  1.545974 2.398971 -0.522222
N  2.393506 1.475697 -0.865914
C  1.392819 0.52624 1.056097
C  0.848167 1.945275 0.795005
C  0.197336 -0.41933 0.788432
C  -0.655134 1.784483 0.566812
C  3.735514 -1.948075 1.301198
C  2.814398 -2.101022 -1.713116
C  5.214568 -0.21593 -0.916694
C  -2.243161 -0.159452 0.157219
C  -3.028116 0.484481 -0.830363
C  -2.724153 -1.314744 0.819781
C  -4.301104 -0.032694 -1.14889
C  -3.996348 -1.825474 0.484735
C  -4.789603 -1.187957 -0.496298
H  1.802068 0.341613 2.061659
H  1.045963 2.712858 1.557663
H  2.745588 -2.314215 1.626547
H  4.39936 -2.825051 1.18857
H  4.162008 -1.305349 2.09248
H  1.861487 -2.537111 -1.365369
H  2.615662 -1.502705 -2.620345
H  3.493422 -2.928335 -1.991436
H  5.947395 -0.983743 -1.22563
H  5.031413 0.455438 -1.773602
H  5.663776 0.383008 -0.104771
H  -2.655149 1.379847 -1.333182
H  -2.110013 -1.813327 1.572983
H  -4.909144 0.467693 -1.909855
H  -4.366739 -2.721317 0.99433
H  -5.777693 -1.586845 -0.749699
