program: Gaussian 09
title: 000291324
version: EM64L-G09RevD.01
frameworkgroup: C1[X(C21H14O5S)]
method: RPBEPBE
basis: SDD
operation: Freq
keyword: #p
keyword: freq=noraman
keyword: PBEPBE/SDD
title: #p freq=noraman PBEPBE/SDD
converged: YES YES NO NO
title: Mulliken charges:
elementType: S O O O O O C C C C C C C C C C C C C C C C C C C C C H H H H H H H H H H H H H H
charge: 0.747170 -0.231996 -0.265882 -0.272008 -0.515853 -0.536784 0.027685 0.437296 0.421707 0.162323 -0.220254 -0.230925 0.146871 0.157465 0.179891 0.159097 -0.301582 -0.305117 -0.362187 -0.366806 -0.224753 -0.399804 -0.395501 -0.209454 -0.208556 -0.190745 -0.684836 0.288683 0.291170 0.267441 0.268632 0.211036 0.210563 0.265197 0.265008 0.247811 0.248460 0.240367 0.202522 0.225284 0.251362
chargesum: 0.00000
title: Mulliken charges with hydrogens summed into heavy atoms:
elementType: S O O O O O C C C C C C C C C C C C C C C C C C C C C
charge: 0.747170 -0.231996 -0.265882 -0.272008 -0.515853 -0.536784 0.027685 0.437296 0.421707 0.162323 -0.220254 -0.230925 0.146871 0.157465 0.179891 0.159097 -0.012899 -0.013946 -0.094746 -0.098174 0.196845 -0.134607 -0.130492 0.038357 0.039904 0.049623 -0.005668
polarizability: 3.30562949e+02 2.00742907e-01 3.03276944e+02 -1.65706544e-01 6.59660083e+00 1.64552572e+02
1716.lowfreq: -3.4259 -0.0011 0.0006 0.0011 5.0050 6.4415 40.9799 53.4238 69.3800
frequency: 40.9588 53.4212 69.3742 82.6150 86.0657 86.9360 116.2281 130.0058 177.3992 192.8496 209.9904 214.2156 231.5662 236.7621 245.3045 256.5495 266.5214 282.5521 298.7436 333.4641 341.7915 357.3380 364.8751 380.3695 402.2259 452.8270 461.9415 472.2402 484.4928 525.0449 528.3077 546.7619 565.8722 573.0346 574.9197 584.7217 606.7738 628.6367 644.1812 672.7890 694.0083 720.4527 727.7973 735.4661 746.4061 789.0721 795.5647 798.2760 800.8764 826.8006 831.9065 840.1728 881.9106 882.6792 891.1730 907.3205 908.3536 917.8379 919.4827 930.8359 970.5206 982.2516 982.6496 993.1629 1025.0474 1057.8943 1061.1195 1068.4706 1112.8733 1118.6710 1126.1161 1134.9492 1158.7280 1168.0847 1175.0684 1185.7784 1211.6980 1216.4917 1229.2856 1255.0115 1259.5233 1276.7799 1281.0322 1357.5799 1379.3082 1390.6424 1393.4494 1402.8100 1419.8546 1439.0933 1442.1549 1447.2028 1458.1595 1459.5269 1462.7063 1480.0053 1490.8373 1555.7611 1573.8543 1597.7362 1612.0969 1614.3245 1636.9743 2956.7813 2994.7075 3016.7561 3092.3325 3107.3036 3152.5866 3153.1321 3153.3284 3165.8920 3167.1924 3175.6882 3180.4598 3181.2542 3185.6934
redmass: 5.3367 4.1831 4.5956 3.0561 2.9477 3.8597 7.3811 8.6572 4.6446 7.7999 4.8493 8.2454 6.9886 3.4208 1.5463 4.0374 4.9218 6.3637 5.5652 8.4730 5.0642 7.8484 6.5516 6.7631 7.7767 6.1718 9.3293 4.8215 10.6424 4.1362 4.1302 5.7694 6.3185 6.6413 7.1706 5.3355 4.3719 7.3501 6.4888 6.7469 7.4050 3.6228 3.0637 3.5556 5.6166 1.6358 2.4774 1.5646 3.1864 1.1146 8.1101 6.7277 1.4995 6.1257 4.5387 1.3891 1.3819 7.2108 18.4604 5.6321 1.3156 1.3369 1.3358 6.1510 2.9618 2.3133 1.7898 1.8352 2.4271 3.3523 2.6883 1.4237 1.7128 1.1265 1.2670 1.5868 3.4501 2.1502 3.0159 4.3744 1.1795 2.7135 2.8024 1.2926 8.5986 8.8493 1.2432 9.0446 2.4393 3.2182 2.7369 3.3447 3.3619 1.0416 3.2632 1.0563 1.0749 6.7569 7.4308 8.0167 8.2670 8.5310 9.0592 1.0550 1.0359 1.1062 1.0989 1.1016 1.0873 1.0873 1.0877 1.0928 1.0928 1.0926 1.0994 1.0994 1.0990
irintensity: 3.1670 1.0942 0.4663 1.4834 0.4251 2.9067 1.2225 0.3871 4.5207 9.8624 1.4001 2.2065 0.4609 1.0696 0.5883 4.4397 1.0722 0.4686 14.4915 2.5657 6.4960 1.8474 7.4211 13.2017 9.9083 1.7977 8.0921 4.2919 37.9209 0.9859 0.2199 1.1283 7.8230 3.1403 5.0730 2.1770 2.3482 1.6509 6.7272 23.4808 3.7308 51.3376 0.3681 7.8850 8.0687 106.2842 92.7832 7.6931 48.2570 3.8593 0.7402 29.9212 1.4594 14.4061 81.2667 1.2362 2.1623 7.5931 82.2269 10.2137 1.1855 0.1851 0.8773 70.7443 66.3850 0.8512 1.0464 12.0729 7.5126 33.3158 2.1913 2.1899 11.8486 0.3643 0.6027 9.7642 5.7604 3.6255 86.7592 144.6055 7.7064 153.9706 101.0576 4.5868 23.2147 44.3576 24.5779 5.7798 20.7207 37.0521 202.0337 25.4170 12.8209 9.3404 49.7923 7.8532 5.8850 0.6946 17.1255 86.6361 40.5036 85.5621 18.6937 30.3844 26.7736 27.1174 24.6271 21.4885 7.2463 12.5602 4.7456 1.1097 0.6430 1.4334 9.8162 7.0986 4.9735
temp: 298.150 k
press: 1.00000 atm
elementType: 16 8 8 8 8 8 6 6 6 6 6 6 6 6 6 6 6 6 6 6 6 6 6 6 6 6 6 1 1 1 1 1 1 1 1 1 1 1 1 1 1
symmnumber: 1
zpe: 775631.5 jmol-1
zpe.correction: 0.295422 hartree
zpe.thermalcorrener: 0.317040 hartree
zpe.thermalcorrenthalpy: 0.317984 hartree
zpe.thermalcorrgfe: 0.246259 hartree
zpe.sumelectzpe: -1580.773865 hartree
zpe.sumelectthermal: -1580.752248 hartree
zpe.sumelectthermalent: -1580.751303 hartree
zpe.sumelectthermalfe: -1580.823028 hartree
dipole: 6.1103 -0.7312 -2.0996
dipole: 6.5022
quadrupole: -170.0223 -133.4725 -168.7682
quadrupole: -1.5660 3.8258 -0.5507
quadrupole: -12.6013 23.9485 -11.3472 -1.5660 3.8258 -0.5507
hfenergy: -1581.0692879 hartree
pointgroup: C01 [X(C21H14O5S1)]
dipole: 2.3441585 0.0774859 1.0213406 debye
polarizability: 329.1475609|-3.1323143|303.2439983|14.0678118|8.564844|166.0009056 unknown
InChI: InChI=1S/C21H14O5S/c1-2-24-21-18-12-6-3-7-13(18)26-15-9-5-11-17(20(15)21)27(22,23)16-10-4-8-14(25-12)19(16)21/h3-11H,2H2,1H3
charge 0 multiplicity 1
41 atoms
S  -2.911562 0.315607 -0.334478
O  0.289193 -0.044793 -1.750346
O  1.457686 -2.680955 0.21428
O  1.973783 2.167209 0.721562
O  -3.102139 0.523219 -1.941448
O  -4.252288 0.364045 0.604068
C  0.271235 -0.037725 -0.233879
C  -0.571691 -1.273613 0.044916
C  -0.29656 1.277251 0.285599
C  1.67056 -0.235632 0.306691
C  -1.979435 -1.28728 0.031589
C  -1.67226 1.582615 0.319834
C  0.056717 -2.533429 0.206389
C  0.573305 2.317158 0.707059
C  2.246042 -1.525687 0.385379
C  2.501891 0.858772 0.636036
C  -2.763001 -2.434735 0.208694
C  -2.204865 2.799874 0.761756
C  -0.68643 -3.723195 0.364448
C  0.088164 3.571741 1.136377
C  0.935037 1.108459 -2.421791
C  3.609181 -1.723655 0.672023
C  3.870215 0.707495 0.928184
C  -2.093264 -3.671093 0.374809
C  -1.298949 3.808934 1.170834
C  4.419414 -0.593532 0.920888
C  0.773657 0.86148 -3.921418
H  -3.85464 -2.363094 0.216789
H  -3.288424 2.949054 0.791342
H  -0.146603 -4.666445 0.484952
H  0.808552 4.332612 1.449407
H  0.431001 2.049076 -2.122199
H  2.004662 1.163655 -2.131374
H  4.008337 -2.740258 0.71123
H  4.471215 1.588158 1.168161
H  -2.670869 -4.590815 0.508286
H  -1.677749 4.77552 1.516686
H  5.482402 -0.731108 1.142224
H  1.21734 1.696646 -4.493913
H  1.274774 -0.075265 -4.219803
H  -0.296131 0.78333 -4.178838
