program: Gaussian 09
title: 000291275
version: EM64L-G09RevD.01
frameworkgroup: C1[X(C12H18N2O2)]
method: RPBEPBE
basis: SDD
operation: Freq
keyword: #p
keyword: freq=noraman
keyword: PBEPBE/SDD
title: #p freq=noraman PBEPBE/SDD
converged: YES YES NO NO
title: Mulliken charges:
elementType: O O N N C C C C C C C C C C C C H H H H H H H H H H H H H H H H H H
charge: -0.411550 -0.214682 -0.085177 -0.580301 -0.029267 -0.406688 -0.418233 -0.572256 0.497243 0.103696 -0.697766 -0.418537 -0.404946 -0.227159 -0.228444 -0.243136 0.219357 0.249119 0.205013 0.257398 0.230247 0.235197 0.201755 0.225109 0.219006 0.211829 0.259346 0.306786 0.228104 0.240094 0.223414 0.224651 0.227593 0.373185
chargesum: 0.00000
title: Mulliken charges with hydrogens summed into heavy atoms:
elementType: O O N N C C C C C C C C C C C C
charge: -0.038365 -0.214682 -0.085177 -0.014169 0.190091 0.047444 0.069412 -0.135305 0.497243 0.103696 -0.041822 -0.190433 -0.164852 -0.003745 -0.003793 -0.015542
polarizability: 1.81853671e+02 -1.12669135e+01 1.47630613e+02 -1.37160680e+01 -1.07283206e+01 1.14800354e+02
1716.lowfreq: -12.9246 -4.9772 -0.0008 -0.0006 -0.0004 2.7637 17.8683 24.9239 34.4794
frequency: 17.7318 24.3631 34.4643 43.5620 62.2021 73.1125 84.0041 145.4283 171.1895 197.0814 222.8868 247.0066 270.3184 322.9497 345.3371 366.3860 373.8177 394.4216 396.1703 403.8286 505.8206 513.0430 575.8778 601.1319 612.1713 618.2806 645.7176 704.9326 710.7404 758.0612 761.7186 796.5544 816.2052 844.8822 854.4434 874.9253 914.1338 924.4817 976.5133 989.9182 994.2973 1006.8924 1024.6651 1027.8331 1040.2322 1052.4687 1077.7159 1096.2123 1114.8692 1116.5635 1143.3050 1171.9725 1186.9371 1200.5444 1217.3665 1220.1167 1230.5907 1244.0931 1277.4909 1290.7531 1298.1582 1323.6198 1327.2982 1358.3606 1376.3950 1382.4422 1395.4282 1440.5723 1456.7450 1473.8278 1478.4269 1481.4599 1483.8723 1484.7234 1592.7414 1615.0517 1638.9739 1665.5984 2860.7902 2917.5740 2978.5695 2992.4920 3008.6426 3040.9108 3058.3389 3062.6821 3078.4453 3086.5907 3112.8104 3115.9508 3131.2746 3143.0111 3161.8789 3331.8115 3496.1217 3552.6798
redmass: 3.8924 4.4440 6.3751 4.9739 3.0955 3.3653 2.5494 3.9773 2.8639 1.5146 4.2184 3.0122 2.3738 2.2930 2.9528 1.7058 2.5889 2.4500 3.0106 2.8180 3.0140 2.7290 2.4649 3.4134 1.5451 6.3318 2.4862 1.9379 2.7010 1.8748 1.7877 1.3208 2.8000 1.9855 1.2470 2.7471 1.8489 1.7090 1.3877 6.2780 1.3141 1.8556 2.4832 2.2926 3.4685 2.4253 1.8412 1.6173 2.0010 2.9748 2.7229 1.0538 1.1161 1.6024 2.0567 1.3926 1.3596 1.3985 1.2134 1.4588 1.2212 1.3485 1.2588 1.6342 1.4401 7.3181 1.2100 2.1816 1.1007 1.0589 1.0569 1.2567 1.0562 1.8418 6.0419 6.1885 1.0916 7.6849 1.0704 1.0825 1.0359 1.0600 1.0602 1.0885 1.0999 1.1010 1.0989 1.1023 1.0871 1.0870 1.0907 1.0958 1.1015 1.0509 1.0637 1.0904
irintensity: 0.1318 0.2474 1.1932 1.2289 0.5646 0.6424 0.1021 0.7522 0.5257 2.0440 0.1948 5.0909 3.2854 1.7972 9.5347 26.3823 5.9244 1.7701 4.4322 0.0578 42.0322 43.6752 150.8552 25.5022 35.6598 0.5817 127.3810 80.8324 45.5212 31.9691 18.6999 2.4817 2.0779 21.9076 0.0897 11.9457 12.6446 2.0952 0.0946 0.1040 0.3232 28.8618 68.0337 96.2491 57.1917 9.3429 10.1387 10.3414 14.9246 48.2256 1.1453 0.0788 0.2231 0.4292 0.0882 0.6166 2.6067 8.0988 1.7396 8.3988 5.0225 7.2583 0.5619 24.9275 5.2875 0.1860 11.7530 6.5315 1.5389 7.0227 10.1092 14.0157 14.0226 14.6317 1.7897 10.6625 11.7902 169.2966 62.6346 51.1424 35.8003 24.9912 13.0437 8.3939 12.9368 25.5896 42.7168 34.5193 10.3122 6.3709 10.6415 43.6938 24.1779 16.4311 19.2297 5.6470
temp: 298.150 k
press: 1.00000 atm
elementType: 8 8 7 7 6 6 6 6 6 6 6 6 6 6 6 6 1 1 1 1 1 1 1 1 1 1 1 1 1 1 1 1 1 1
symmnumber: 1
zpe: 743688.5 jmol-1
zpe.correction: 0.283256 hartree
zpe.thermalcorrener: 0.300336 hartree
zpe.thermalcorrenthalpy: 0.301280 hartree
zpe.thermalcorrgfe: 0.235371 hartree
zpe.sumelectzpe: -726.760674 hartree
zpe.sumelectthermal: -726.743594 hartree
zpe.sumelectthermalent: -726.742650 hartree
zpe.sumelectthermalfe: -726.808559 hartree
dipole: -0.8040 -1.0235 1.8453
dipole: 2.2581
quadrupole: -94.8834 -85.0474 -100.6943
quadrupole: -0.4429 0.1910 0.8990
quadrupole: -1.3417 8.4943 -7.1526 -0.4429 0.1910 0.8990
hfenergy: -727.0439299 hartree
pointgroup: C01 [X(C12H18N2O2)]
dipole: -0.320867 -0.3756363 0.7383733 debye
polarizability: 181.9037634|-11.7991236|146.8987234|-13.03625|-11.881723|115.4821516 unknown
InChI: InChI=1S/C12H18N2O2/c1-2-11(12(15)16)14(13)9-8-10-6-4-3-5-7-10/h3-7,11,15H,2,8-9,13H2,1H3
charge 0 multiplicity 1
34 atoms
O  2.580623 2.024773 1.20716
O  2.322721 1.781668 -1.086517
N  1.442567 -0.986264 -0.239072
N  1.581901 -2.39079 0.033552
C  2.602725 -0.23608 0.351296
C  0.110846 -0.458315 0.169231
C  3.939229 -0.745479 -0.249281
C  -1.018892 -0.987182 -0.750178
C  -2.374059 -0.419454 -0.355817
C  2.466947 1.252769 0.035607
C  5.186278 -0.139244 0.427103
C  -3.214276 -1.107166 0.557517
C  -2.809311 0.833611 -0.861268
C  -4.455119 -0.560954 0.956971
C  -4.049166 1.383995 -0.465914
C  -4.876927 0.68848 0.446395
H  2.634886 -0.341275 1.460593
H  0.129792 0.643572 0.096098
H  -0.120969 -0.714848 1.234612
H  3.924354 -1.842985 -0.131037
H  3.93205 -0.524399 -1.332808
H  -0.758822 -0.709572 -1.788187
H  -1.042234 -2.092616 -0.69748
H  5.245911 0.955659 0.285337
H  6.10514 -0.580702 0.0011
H  5.189122 -0.336854 1.515461
H  1.151224 -2.698686 0.922508
H  1.316554 -2.963726 -0.771329
H  -2.896988 -2.081313 0.951338
H  -2.174404 1.375151 -1.573966
H  -5.093109 -1.108869 1.659969
H  -4.371609 2.349955 -0.871254
H  -5.840137 1.112742 0.751453
H  2.547351 2.990598 0.962109
