program: Gaussian 09
title: 000291277
version: EM64L-G09RevD.01
frameworkgroup: C1[X(C17H19Cl2NO2)]
method: RPBEPBE
basis: SDD
operation: Freq
keyword: #p
keyword: freq=noraman
keyword: PBEPBE/SDD
title: #p freq=noraman PBEPBE/SDD
converged: YES YES NO NO
title: Mulliken charges:
elementType: Cl Cl O O N C C C C C C C C C C C C C C C C C H H H H H H H H H H H H H H H H H H H
charge: -0.058815 -0.060166 -0.289519 -0.244751 -0.133086 0.017849 0.239659 0.104234 0.407083 -0.345292 -0.314452 0.236023 -0.471514 -0.376542 -0.366558 -0.436246 -0.592596 -0.588784 -0.251761 -0.251448 -0.246012 -0.683386 0.242399 0.271859 0.227360 0.276763 0.240042 0.249187 0.244518 0.242364 0.313812 0.262409 0.306914 0.259200 0.229132 0.231333 0.222273 0.206627 0.212787 0.242231 0.224871
chargesum: 0.00000
title: Mulliken charges with hydrogens summed into heavy atoms:
elementType: Cl Cl O O N C C C C C C C C C C C C C C C C C
charge: -0.058815 -0.060166 -0.289519 -0.244751 -0.133086 0.017849 0.239659 0.104234 0.407083 0.168966 0.189672 0.236023 -0.231472 -0.127356 -0.122041 -0.193883 -0.016375 -0.022670 -0.022629 -0.020115 0.182889 -0.003497
polarizability: 2.49727487e+02 -6.59650535e+00 2.64166100e+02 1.74138927e+01 -2.00436667e+01 1.60260327e+02
1716.lowfreq: -4.7426 -0.0017 -0.0011 -0.0007 3.3448 7.6128 17.0820 28.1981 33.6984
frequency: 16.7019 28.1678 33.6463 36.9099 46.8694 72.3557 79.7290 88.4444 95.7894 108.0002 120.0830 138.1789 149.3243 164.1426 208.3736 216.8427 234.4253 239.4736 252.4326 272.5968 298.1456 323.3535 350.5124 380.0676 403.4446 425.2501 452.0214 475.7980 524.2945 528.0955 555.6068 583.6752 626.4148 657.6215 690.7144 693.4639 696.9537 711.3732 730.8728 755.3719 779.7049 787.8180 795.7254 810.1468 818.6442 835.0599 837.2576 874.4021 908.5919 946.9189 966.3218 967.9433 989.5366 997.0956 1003.2656 1026.8230 1039.5891 1043.4421 1051.7583 1061.8477 1114.8868 1121.5540 1130.9387 1134.5969 1161.2114 1174.9044 1198.6232 1224.2829 1231.3459 1241.8154 1256.5282 1264.0698 1266.1528 1270.5498 1283.0128 1303.9554 1350.3754 1353.9944 1360.0801 1365.5619 1393.3519 1402.9499 1406.8030 1417.1876 1435.1992 1447.1471 1456.1723 1458.8743 1461.7072 1467.5432 1473.1941 1478.7366 1490.2237 1513.7480 1564.8691 1580.6846 1598.2362 1631.8306 2964.1875 2997.7894 3016.4543 3026.4097 3030.2751 3061.1434 3063.6834 3093.4060 3093.7860 3097.1843 3108.4414 3123.0125 3131.3110 3132.5169 3147.3737 3153.6420 3157.5601 3164.6216 3168.9024
redmass: 7.1770 8.2625 8.5636 6.9640 4.1012 3.6015 4.2479 3.5717 3.4468 2.0803 2.4604 5.7723 5.0933 3.9535 4.8222 5.5816 4.2345 1.2406 4.6991 5.2335 4.6167 4.3448 3.5597 4.2219 3.7455 4.1868 3.8329 4.3831 6.1655 3.8515 6.8429 3.6880 6.3277 5.7824 4.2446 5.6236 5.7238 4.9504 5.1499 1.3223 1.2578 1.1602 2.9949 1.6182 3.2473 1.3443 2.7553 1.7491 4.3303 1.3367 1.4196 3.3985 1.3442 1.6014 1.8756 2.3346 2.5182 4.0904 3.9567 2.4821 2.1660 1.4066 1.6662 1.4330 1.2976 1.0947 1.6945 2.4390 2.3356 2.5804 1.2185 1.1696 1.1651 1.5794 1.4444 1.2896 2.4673 1.2454 1.3241 1.3989 2.4660 1.3661 2.3371 3.5261 3.8987 1.1119 1.1102 2.2192 1.0478 1.1265 1.1206 1.0715 1.1227 3.5607 8.1729 8.6196 5.9853 6.8001 1.0560 1.0365 1.0638 1.1074 1.0595 1.0570 1.0584 1.0994 1.0990 1.1048 1.1013 1.0865 1.0884 1.0883 1.0949 1.1118 1.1106 1.1004 1.0945
irintensity: 0.1218 0.1777 0.2507 1.4346 0.5544 3.1608 3.0586 3.4003 2.3158 1.1528 2.2126 0.9250 1.4659 2.9438 2.1767 0.6677 3.7323 0.4286 3.1575 3.8843 2.1578 9.2378 5.1880 5.4020 7.4633 4.9643 11.5063 14.2524 1.2836 0.4387 1.2243 8.9908 37.7231 12.3886 36.4670 47.1722 9.1608 11.4250 20.4144 31.0754 9.9479 12.6732 1.5673 43.8979 28.9698 2.3345 20.6516 7.2897 9.4978 0.2783 2.3688 25.9837 0.5361 19.8153 9.0525 27.2688 35.0620 45.0847 11.0307 47.9386 12.8754 24.4885 38.7685 5.4125 21.8798 8.2366 44.9817 190.7610 21.6407 71.7700 30.6969 8.4603 0.6859 24.1081 47.0613 15.1490 5.6547 0.7823 9.7606 19.8927 108.5386 35.2193 12.5410 10.8921 19.4846 18.5698 14.3362 39.3196 15.0451 16.5919 11.7335 7.3924 12.4518 61.5540 223.7446 8.5202 41.3164 34.2937 47.0918 21.2904 14.4771 25.1999 13.4500 12.5231 20.2655 6.0637 35.8818 3.5430 27.9901 3.1833 2.1450 7.3332 30.7196 6.4442 5.1595 33.0474 12.2598
temp: 298.150 k
press: 1.00000 atm
elementType: 17 17 8 8 7 6 6 6 6 6 6 6 6 6 6 6 6 6 6 6 6 6 1 1 1 1 1 1 1 1 1 1 1 1 1 1 1 1 1 1 1
symmnumber: 1
zpe: 850700.6 jmol-1
zpe.correction: 0.324015 hartree
zpe.thermalcorrener: 0.346376 hartree
zpe.thermalcorrenthalpy: 0.347320 hartree
zpe.thermalcorrgfe: 0.268944 hartree
zpe.sumelectzpe: -1782.918613 hartree
zpe.sumelectthermal: -1782.896252 hartree
zpe.sumelectthermalent: -1782.895308 hartree
zpe.sumelectthermalfe: -1782.973683 hartree
dipole: 3.7888 2.1882 1.0936
dipole: 4.5099
quadrupole: -141.8845 -128.8192 -159.7563
quadrupole: -1.0151 -4.2975 -17.2285
quadrupole: 1.6022 14.6674 -16.2696 -1.0151 -4.2975 -17.2285
hfenergy: -1783.2426275 hartree
pointgroup: C01 [X(C17H19Cl2N1O2)]
dipole: -1.2199821 -1.1415599 0.5972747 debye
polarizability: 256.7578071|-13.3728989|260.8856027|-13.7410143|-7.4573458|156.5105045 unknown
InChI: InChI=1S/C17H19Cl2NO2/c1-2-22-15-8-7-13-5-3-4-6-14(13)16(15)17(21)20(11-9-18)12-10-19/h3-8H,2,9-12H2,1H3
charge 0 multiplicity 1
41 atoms
Cl 1.802504 -1.394299 3.793616
Cl 4.968901 3.049325 -0.893043
O  0.289438 -2.361504 -0.578036
O  1.167745 0.591512 -2.103007
N  1.830741 0.53532 0.1202
C  -0.501135 -0.113495 -0.482073
C  -1.550289 0.8546 -0.303295
C  0.884967 0.343446 -0.889843
C  -2.899352 0.398312 -0.027404
C  1.57804 0.268522 1.551866
C  3.186341 0.981364 -0.283887
C  -0.79776 -1.485615 -0.406828
C  -3.153364 -1.008133 0.038269
C  -2.13165 -1.937788 -0.14889
C  -1.311457 2.268986 -0.387721
C  -3.943603 1.361908 0.163033
C  2.110907 -1.120023 1.948925
C  3.20215 2.501349 -0.511927
C  -2.349782 3.18266 -0.198365
C  -3.678321 2.72967 0.083162
C  0.011161 -3.804859 -0.764658
C  1.344973 -4.471193 -1.089515
H  2.071543 1.047081 2.162484
H  0.496012 0.320931 1.752138
H  3.906342 0.709817 0.507128
H  3.471681 0.471047 -1.218965
H  -4.173713 -1.3538 0.240917
H  -2.351407 -3.007185 -0.091313
H  -0.303716 2.62794 -0.623253
H  -4.959174 1.004358 0.371092
H  1.581782 -1.922174 1.417661
H  3.199606 -1.211348 1.816851
H  2.601227 2.781917 -1.387649
H  2.901609 3.066772 0.383115
H  -2.151634 4.257688 -0.27156
H  -4.481502 3.459709 0.229285
H  -0.714949 -3.928773 -1.592542
H  -0.429112 -4.220228 0.164732
H  1.194895 -5.553962 -1.251954
H  1.783931 -4.036042 -2.002862
H  2.062821 -4.34231 -0.260983
