program: Gaussian 09
title: 000291243
version: EM64L-G09RevD.01
frameworkgroup: C1[X(C15H15N3O2)]
method: RPBEPBE
basis: SDD
operation: Freq
keyword: #p
keyword: freq=noraman
keyword: PBEPBE/SDD
title: #p freq=noraman PBEPBE/SDD
converged: YES YES NO NO
title: Mulliken charges:
elementType: O O N N N C C C C C C C C C C C C C C C H H H H H H H H H H H H H H H
charge: -0.259003 -0.264057 -0.162487 -0.041850 -0.121886 0.279294 0.190398 -0.301510 -0.353042 0.163508 0.325101 -0.354281 -0.269356 -0.330450 -0.334143 -0.250213 -0.226723 -0.225506 -0.624780 -0.537185 0.254584 0.267010 0.247369 0.274405 0.244554 0.253401 0.231412 0.231773 0.231415 0.248849 0.246421 0.269483 0.224821 0.248384 0.224291
chargesum: 0.00000
title: Mulliken charges with hydrogens summed into heavy atoms:
elementType: O O N N N C C C C C C C C C C C C C C C
charge: -0.259003 -0.264057 -0.162487 -0.041850 -0.121886 0.279294 0.190398 -0.046926 -0.086032 0.163508 0.325101 -0.106912 0.005049 -0.085896 -0.080742 -0.018801 0.005050 0.005910 0.139973 0.160309
polarizability: 3.67157186e+02 -1.33535141e+01 2.16929397e+02 1.94134771e+01 1.08771032e+00 1.00271362e+02
1716.lowfreq: -5.2001 0.0004 0.0007 0.0008 3.2288 4.0152 31.9927 32.7759 37.6894
frequency: 31.9703 32.7406 37.6870 61.8804 79.4438 106.0524 117.4624 140.3064 164.6234 184.7757 206.2138 228.0873 239.3491 260.1966 265.1361 336.3054 367.8241 376.6580 402.2919 406.9800 416.9060 430.8740 440.0612 484.5834 539.2546 542.9246 580.1598 614.7500 630.3647 652.7922 685.9628 698.5619 714.9260 736.9225 780.3794 791.6830 814.4074 847.8288 850.8408 885.4593 906.1030 934.5766 951.9499 978.1012 982.8937 984.5996 990.3166 993.3586 1000.1294 1012.1971 1035.7924 1088.5710 1109.7309 1111.9234 1113.4238 1151.0252 1159.0020 1171.8611 1174.2628 1191.2790 1193.8296 1229.1871 1241.4091 1294.0192 1320.3977 1324.3757 1360.8777 1376.9684 1382.1553 1408.1352 1432.5180 1434.2171 1436.3560 1462.7550 1467.6631 1471.5102 1474.5345 1479.7051 1488.4919 1557.8064 1571.3259 1592.2344 1607.8789 1617.2200 2964.1768 3008.3783 3054.2243 3094.1387 3128.3327 3129.7927 3141.1260 3148.4010 3149.5570 3153.9367 3155.2008 3168.0797 3170.5977 3174.7339 3182.8762
redmass: 3.9159 4.4080 5.2971 4.4608 3.9169 4.2229 4.8148 4.3404 1.1615 4.2819 1.9248 3.7033 2.5679 3.4796 3.4029 5.4323 6.1601 4.3923 3.0645 4.1763 4.3755 4.0988 4.8811 5.2825 2.5010 5.2926 6.5258 6.4495 6.8754 6.0853 5.3621 1.5406 5.8337 3.8774 4.6283 2.5332 1.2846 1.5088 1.3184 4.7009 5.7666 1.4908 1.3730 1.3947 1.4866 5.4722 5.7719 2.5787 1.3408 2.7133 2.0202 1.5992 1.2946 1.2605 1.3254 1.4221 1.4332 2.8835 1.1361 2.2193 1.1595 3.4236 4.4425 1.3531 1.3150 4.5459 6.5061 5.7314 8.3157 1.2700 2.2488 3.5244 1.2512 1.0576 1.0511 1.1153 1.2609 1.7618 2.2249 8.7355 6.9596 6.7985 6.0412 6.5866 1.0328 1.0331 1.1042 1.1008 1.0853 1.0997 1.0895 1.1013 1.0878 1.0877 1.0944 1.0981 1.0961 1.0974 1.0961
irintensity: 0.7339 0.6497 0.5168 0.5407 6.8609 0.3884 2.4453 0.8392 1.2413 4.3749 4.3943 0.5523 3.9734 10.3443 5.7022 0.6511 1.1791 9.6088 0.8205 1.8296 2.2912 0.4438 6.0106 3.1883 21.3154 84.3483 10.0562 0.1752 13.9303 16.1772 6.1703 108.1923 3.6939 1.3655 2.4638 32.9894 14.0561 50.6495 19.6358 4.5735 3.6477 4.3848 1.2790 3.7464 6.6552 69.8028 1.6420 39.8036 2.0487 280.7145 103.3296 3.2611 9.4892 0.2998 0.4470 107.3314 40.8472 87.2342 8.5219 47.3911 3.6281 166.7488 176.4367 27.3736 1.4709 489.4030 3.0888 0.1100 3.8999 67.1976 10.5094 11.0364 25.3469 28.8655 15.5637 109.3400 14.1264 56.5300 33.8431 276.8510 36.3041 74.0099 12.5296 119.9114 92.6563 19.9552 45.0331 15.2187 0.3028 25.1688 12.0774 0.6344 7.5425 1.2650 20.6525 25.4193 14.6351 6.7915 4.6081
temp: 298.150 k
press: 1.00000 atm
elementType: 8 8 7 7 7 6 6 6 6 6 6 6 6 6 6 6 6 6 6 6 1 1 1 1 1 1 1 1 1 1 1 1 1 1 1
symmnumber: 1
zpe: 713428.0 jmol-1
zpe.correction: 0.271730 hartree
zpe.thermalcorrener: 0.289964 hartree
zpe.thermalcorrenthalpy: 0.290908 hartree
zpe.thermalcorrgfe: 0.223861 hartree
zpe.sumelectzpe: -893.812038 hartree
zpe.sumelectthermal: -893.793804 hartree
zpe.sumelectthermalent: -893.792860 hartree
zpe.sumelectthermalfe: -893.859907 hartree
dipole: 4.7006 -1.0717 0.5867
dipole: 4.8568
quadrupole: -98.0724 -108.3410 -117.9458
quadrupole: 15.1620 3.8822 0.5170
quadrupole: 10.0473 -0.2213 -9.8260 15.1620 3.8822 0.5170
hfenergy: -894.0837682 hartree
pointgroup: C01[X(C15H15N3O2)]
dipole: -1.8677734 -0.2804297 -0.2898062 debye
polarizability: 368.6171907|3.3631962|206.6782547|15.4726129|31.9318413|109.0624997 unknown
InChI: InChI=1S/C15H15N3O2/c1-18(15(19)12-6-4-3-5-7-12)17-16-13-8-10-14(20-2)11-9-13/h3-11H,1-2H3
charge 0 multiplicity 1
35 atoms
O  -5.347912 -1.376905 0.06024
O  4.01549 1.670826 0.835435
N  1.716951 1.646147 0.549612
N  0.582607 0.856112 0.393554
N  -0.524447 1.5367 0.540322
C  3.120088 -0.384212 -0.060231
C  2.993481 1.018578 0.463067
C  2.297896 -0.950761 -1.070898
C  4.22806 -1.128741 0.428247
C  -1.70842 0.746127 0.412832
C  -4.187649 -0.605511 0.186164
C  -2.928946 1.461162 0.49161
C  -1.741003 -0.669575 0.225188
C  -4.168613 0.799437 0.377932
C  -2.967869 -1.334207 0.113226
C  2.576738 -2.241591 -1.569466
C  4.488749 -2.427223 -0.054452
C  3.662474 -2.988656 -1.056459
C  1.615031 3.074126 0.917614
C  -6.638502 -0.684826 0.134967
H  1.454061 -0.385209 -1.472003
H  4.877206 -0.666179 1.178615
H  -2.884892 2.545008 0.640857
H  -0.799891 -1.226035 0.179651
H  -5.095592 1.376278 0.440326
H  -3.019259 -2.418378 -0.026368
H  1.945622 -2.664035 -2.359073
H  5.336838 -2.996058 0.341782
H  3.868158 -3.99428 -1.440274
H  1.060239 3.180829 1.86519
H  1.063041 3.622427 0.136052
H  2.639754 3.455281 1.025196
H  -6.770363 -0.187963 1.115481
H  -7.394194 -1.474245 0.013601
H  -6.741233 0.059852 -0.677836
