program: Gaussian 09
title: 000291240
version: EM64L-G09RevD.01
frameworkgroup: C1[X(C17H18O)]
method: RPBEPBE
basis: SDD
operation: Freq
keyword: #pfreq=noraman
keyword: PBEPBE/SDD
title: #p freq=noraman PBEPBE/SDD
converged: YES YES NO NO
title: Mulliken charges:
elementType: O C C C C C C C C C C C C C C C C C H H H H H H H H H H H H H H H H H H
charge: -0.450187 -0.080091 -0.292598 0.384172 0.383911 0.351558 0.349585 -0.729728 -0.740439 -0.771574 -0.403455 -0.403545 -0.410609 -0.409898 -0.275347 -0.275319 -0.254924 -0.254822 0.227324 0.227303 0.218756 0.212538 0.212572 0.242518 0.236322 0.244539 0.235841 0.227033 0.227030 0.260243 0.261019 0.348031 0.224512 0.224487 0.226622 0.226621
chargesum: 0.00000
title: Mulliken charges with hydrogens summed into heavy atoms:
elementType: O C C C C C C C C C C C C C C C C C
charge: -0.102156 -0.080091 -0.292598 0.384172 0.383911 0.351558 0.349585 -0.056345 -0.072812 -0.054872 -0.176421 -0.176516 -0.150366 -0.148879 -0.050835 -0.050833 -0.028302 -0.028201
polarizability: 2.29469822e+02 2.19388522e-02 1.94393614e+02 -1.11881366e-02 1.14179745e+00 1.07202328e+02
1716.lowfreq: -161.3771 -9.4718 0.0004 0.0005 0.0007 9.4407 10.5050 36.0571 74.9980
frequency: -161.3632 36.0447 74.9860 92.3703 133.4385 152.4351 195.4930 225.4895 238.0971 252.1661 258.9237 284.5225 297.8963 316.9900 324.8130 357.4726 374.8141 375.5769 397.3627 407.1460 495.5327 502.9000 544.5105 567.1911 572.8659 590.2130 604.0578 624.9623 662.7978 733.4060 759.7855 765.9253 767.9891 777.7212 793.1077 852.7948 871.3813 877.1089 883.6789 912.9132 925.0201 953.1631 954.2614 986.3124 986.7127 1008.9961 1010.1505 1038.1492 1044.1398 1049.3639 1063.7635 1092.1379 1098.1597 1099.4310 1126.5236 1146.7725 1168.1061 1175.4651 1176.7775 1214.7239 1227.5007 1273.9816 1276.2089 1298.1301 1311.6621 1369.2834 1374.7722 1380.1908 1385.1114 1398.9244 1432.7828 1434.3322 1454.5970 1457.7199 1466.2099 1467.2293 1473.3031 1482.5030 1486.7870 1497.7743 1578.6169 1597.7024 1609.0983 1616.0384 2970.9702 2976.9232 2999.7333 3067.9864 3076.5460 3080.7044 3089.6373 3093.3823 3101.1390 3123.8491 3123.9163 3138.1060 3138.3527 3151.1005 3151.6043 3164.2690 3164.9605 3581.5460
redmass: 1.2831 3.9370 3.6456 3.5786 3.8025 1.7220 1.6827 4.2428 2.3745 1.0590 1.0894 3.4552 3.3362 2.7907 3.1319 4.8093 2.4706 3.4563 3.5625 5.5628 3.0869 3.4648 3.5663 3.2672 3.9559 3.8200 3.9363 5.7954 5.9129 5.8695 3.5201 1.2682 1.3215 3.5728 2.6128 2.9777 1.6929 1.4482 2.4274 2.4029 1.6356 1.4152 1.3927 1.3286 1.3247 1.3116 2.5089 2.4512 2.3666 2.4270 2.8111 2.2790 1.8478 1.7467 3.1946 1.7439 1.9381 1.0619 1.0796 2.9425 1.5317 3.7649 1.5063 2.0443 1.8377 10.9704 1.2022 1.8468 2.1980 1.2437 2.1197 2.2455 1.0586 1.0860 1.1030 1.6406 1.1523 1.9910 1.2748 1.1419 6.9759 7.7420 6.2378 6.4425 1.0353 1.0340 1.0355 1.1009 1.1006 1.0999 1.0976 1.0980 1.1005 1.0846 1.0847 1.0888 1.0890 1.0936 1.0936 1.0996 1.0996 1.0670
irintensity: 91.9699 0.0999 0.1625 0.1396 3.0216 0.7515 0.4370 0.4316 0.3430 0.0362 0.1106 1.7956 1.1344 0.0157 0.0489 0.2583 0.1809 0.0995 4.0018 0.3850 3.4601 1.1943 0.0179 28.2833 0.8273 10.6664 0.0179 4.6057 0.2182 4.9024 0.1540 3.2993 130.4954 1.7022 2.5900 0.7286 10.3360 0.0435 34.5245 0.0098 0.6440 2.6319 0.4041 0.0543 0.0047 0.9989 15.3707 43.9616 15.8724 0.4955 36.7161 11.1262 7.9490 1.4129 2.5086 19.7016 29.1393 1.0520 0.0170 1.8053 0.0416 51.6843 3.6257 1.5701 31.7042 2.9705 4.6497 14.7317 15.5801 10.6167 0.2833 20.3662 9.7784 0.0805 6.7898 12.3256 2.5716 6.9649 41.0371 13.0239 1.4299 1.9409 1.2016 1.4951 22.5943 30.6915 25.7284 27.9582 29.0486 31.3785 12.6783 53.5744 24.7703 0.2640 0.0114 14.0189 13.1913 9.9890 51.5768 56.1699 1.7972 9.9798
temp: 298.150 k
press: 1.00000 atm
elementType: 8 6 6 6 6 6 6 6 6 6 6 6 6 6 6 6 6 6 1 1 1 1 1 1 1 1 1 1 1 1 1 1 1 1 1 1
symmnumber: 1
zpe: 782478.5 jmol-1
zpe.correction: 0.298030 hartree
zpe.thermalcorrener: 0.313602 hartree
zpe.thermalcorrenthalpy: 0.314546 hartree
zpe.thermalcorrgfe: 0.256438 hartree
zpe.sumelectzpe: -732.545670 hartree
zpe.sumelectthermal: -732.530098 hartree
zpe.sumelectthermalent: -732.529154 hartree
zpe.sumelectthermalfe: -732.587262 hartree
dipole: -0.0122 0.1301 2.2458
dipole: 2.2496
quadrupole: -99.3134 -93.1240 -113.2399
quadrupole: 0.0443 0.0041 -4.7931
quadrupole: 2.5790 8.7684 -11.3475 0.0443 0.0041 -4.7931
hfenergy: -732.8436999 hartree
pointgroup: C01 [X(C17H18O1)]
dipole: 0.0047993 0.0607137 -0.8829644 debye
polarizability: 229.4698194|-0.0235752|194.4080993|-0.0107688|-0.2018195|107.187845 unknown
InChI: InChI=1S/C17H18O/c1-16(2)12-8-4-6-10-14(12)17(3,18)15-11-7-5-9-13(15)16/h4-11,18H,1-3H3
charge 0 multiplicity 1
36 atoms
O  -0.001424 -2.757962 0.605998
C  -0.000029 1.528314 -0.178952
C  -0.000319 -1.525986 -0.229897
C  1.281191 0.691917 0.042341
C  -1.281367 0.692084 0.042359
C  1.270562 -0.72823 0.070172
C  -1.270992 -0.72806 0.070281
C  0.000016 2.072013 -1.649013
C  0.000087 2.74614 0.798577
C  -0.000424 -1.954403 -1.727958
C  2.53323 1.349148 0.194944
C  -2.533332 1.349487 0.194841
C  2.471421 -1.443594 0.305217
C  -2.471936 -1.44331 0.305236
C  3.729791 0.635255 0.402008
C  -3.729994 0.635754 0.401897
C  3.698867 -0.776365 0.474434
C  -3.699276 -0.775872 0.474385
H  -0.896989 2.691511 -1.830678
H  0.897119 2.691369 -1.830689
H  -0.000059 1.24664 -2.382961
H  0.884101 3.385914 0.640114
H  -0.883844 3.386033 0.640167
H  0.000087 2.405486 1.848513
H  -0.905764 -2.548398 -1.956293
H  -0.000482 -1.073357 -2.39156
H  0.904989 -2.548255 -1.956632
H  2.581352 2.442162 0.15714
H  -2.581326 2.442502 0.156931
H  2.421394 -2.534194 0.3799
H  -2.421666 -2.533881 0.379825
H  0.006658 -3.548973 0.012017
H  4.675752 1.176199 0.517619
H  -4.675886 1.176842 0.517422
H  4.617005 -1.344532 0.660241
H  -4.617513 -1.343894 0.660148
