program: Gaussian 09
title: 000291226
version: EM64L-G09RevD.01
frameworkgroup: C1[X(C17H19N3O)]
method: RPBEPBE
basis: SDD
operation: Freq
keyword: #p
keyword: freq=noraman
keyword: PBEPBE/SDD
title: #p freq=noraman PBEPBE/SDD
converged: YES YES NO NO
title: Mulliken charges:
elementType: O N N N C C C C C C C C C C C C C C C C C H H H H H H H H H H H H H H H H H H H
charge: -0.417692 -0.162618 -0.161546 -0.037728 0.264503 0.270235 0.219535 0.252652 -0.340985 -0.593094 -0.578845 -0.438748 -0.449777 0.437960 0.450447 -0.373754 -0.377068 -0.646735 -0.648001 -0.646699 -0.648530 0.282674 0.310718 0.237690 0.238809 0.234230 0.234828 0.230679 0.214335 0.230397 0.234266 0.234533 0.214036 0.229950 0.214668 0.230737 0.213327 0.235154 0.236052 0.369402
chargesum: 0.00000
title: Mulliken charges with hydrogens summed into heavy atoms:
elementType: O N N N C C C C C C C C C C C C C C C C C
charge: -0.048290 -0.162618 -0.161546 -0.037728 0.264503 0.270235 0.219535 0.252652 -0.340985 -0.310420 -0.268127 -0.201058 -0.210968 0.437960 0.450447 -0.139524 -0.142239 0.028676 0.034835 0.028656 0.036002
polarizability: 4.28823194e+02 -2.03644097e+00 2.37277911e+02 2.36973729e-02 1.39205630e-01 1.00863308e+02
1716.lowfreq: -8.3287 -6.8161 -5.6340 -0.0007 -0.0006 -0.0004 32.2272 47.9128 52.9429
frequency: 31.9568 47.7850 52.8953 70.0998 86.3669 97.9542 99.0803 112.2893 146.0811 148.2338 165.8854 201.2181 207.2255 219.3266 226.2785 226.8010 278.9394 287.2988 300.4292 347.2236 384.2359 403.2914 407.9358 443.0721 444.0105 456.5985 461.2436 495.2097 524.1289 535.5702 558.7225 569.6403 615.9071 629.6856 671.4351 686.1310 728.2632 747.6692 776.6138 782.8079 804.7507 821.5028 827.0290 881.8939 885.2754 900.6039 933.5947 938.1407 940.4329 960.2329 971.6141 1032.5269 1054.9661 1056.8790 1073.8987 1107.3050 1107.8344 1109.6707 1110.3488 1139.0518 1143.5959 1149.9574 1180.6184 1212.8802 1238.7165 1259.7752 1262.4763 1289.8157 1301.9281 1312.4617 1348.3018 1357.8022 1368.5042 1386.0678 1427.7869 1429.8749 1447.1772 1452.4810 1452.9967 1461.0782 1461.4368 1471.0240 1472.4107 1472.8788 1489.1934 1491.1996 1496.1255 1498.9755 1510.6492 1516.4706 1575.2915 1581.0535 1601.0700 1628.6879 1638.8204 2929.5472 2930.1231 2939.4982 2941.1540 2990.6314 2991.5156 2997.8024 3000.2495 3089.4558 3091.5295 3100.2531 3101.1228 3124.9695 3127.9822 3162.5369 3163.7276 3172.2213 3210.2616 3562.0914
redmass: 4.0160 2.5556 2.8732 3.3562 2.0247 3.8716 1.7706 3.0901 5.1689 1.8890 1.7350 1.1902 1.3235 3.9487 2.4533 4.3330 3.7502 4.7158 3.0912 5.1113 4.0872 2.5237 3.7775 4.3650 1.6526 3.1151 3.0133 4.0400 2.9319 3.7583 5.3051 4.3183 2.8189 5.3170 6.3161 3.4446 6.4829 6.0538 2.5826 3.6313 1.5109 1.9664 6.3233 1.6537 8.4761 1.7638 3.8854 1.3628 1.4323 2.5340 5.0773 2.4735 1.5031 1.5030 3.1622 1.2904 1.2956 1.2654 1.2593 1.5694 1.6861 1.6199 1.7684 2.1912 1.6695 2.3935 2.8742 1.6586 1.9982 1.7514 2.7614 3.2767 7.6766 3.7280 1.1895 1.1763 1.5941 1.4089 2.3387 1.0406 1.0406 3.5793 1.0470 1.0463 1.4722 1.3888 1.2511 1.4224 1.2496 1.5374 6.9530 7.5088 6.8600 7.2572 7.5151 1.0372 1.0372 1.0393 1.0392 1.1002 1.1000 1.1017 1.1015 1.0959 1.0954 1.0937 1.0934 1.0890 1.0891 1.0933 1.0933 1.0910 1.0910 1.0674
irintensity: 4.7016 0.0094 0.2462 0.0138 8.9853 2.0118 0.1397 0.3595 0.1392 0.4221 0.7228 0.1438 0.2290 0.0708 1.2810 0.0105 0.8932 3.5805 5.9657 1.1854 2.4705 36.2753 8.8696 1.0181 43.2982 3.2928 0.1439 2.2987 61.7414 5.8227 1.4021 0.4590 0.1798 5.4879 3.3605 3.0254 5.0606 8.8317 0.1552 22.5253 85.4080 1.4792 28.1720 5.1574 148.2290 45.9079 65.9742 2.6048 0.9014 0.6666 5.2631 4.7146 29.0400 22.0011 25.0060 0.6776 0.7866 0.5208 0.3927 4.6808 21.8178 15.0711 3.3166 28.6010 2.7490 3.8383 56.6461 6.3811 49.8140 37.0568 255.8793 23.2562 11.0769 2.6503 6.2784 1.4191 186.7837 8.8254 38.7136 0.2169 0.3284 3.7941 20.0930 20.0353 88.6285 85.5570 17.0654 1.2890 563.8204 46.8716 112.0678 3.7477 17.9701 129.8632 140.5717 113.4451 149.0451 216.8891 52.9625 38.1176 32.6566 66.7906 60.2329 3.9571 3.9536 65.2414 51.8299 10.9589 15.4736 27.3798 28.8838 8.4505 5.3504 60.3064
temp: 298.150 k
press: 1.00000 atm
elementType: 8 7 7 7 6 6 6 6 6 6 6 6 6 6 6 6 6 6 6 6 6 1 1 1 1 1 1 1 1 1 1 1 1 1 1 1 1 1 1 1
symmnumber: 1
zpe: 851438.2 jmol-1
zpe.correction: 0.324296 hartree
zpe.thermalcorrener: 0.344694 hartree
zpe.thermalcorrenthalpy: 0.345638 hartree
zpe.thermalcorrgfe: 0.275114 hartree
zpe.sumelectzpe: -897.122165 hartree
zpe.sumelectthermal: -897.101766 hartree
zpe.sumelectthermalent: -897.100822 hartree
zpe.sumelectthermalfe: -897.171346 hartree
dipole: -0.1865 0.5153 0.0428
dipole: 0.5496
quadrupole: -73.7894 -106.7746 -131.5824
quadrupole: -0.4637 0.0293 0.0011
quadrupole: 30.2595 -2.7258 -27.5336 -0.4637 0.0293 0.0011
hfenergy: -897.4464602 hartree
pointgroup: C01 [X(C17H19N3O1)]
dipole: 0.0745501 0.2028276 -0.0080688 debye
polarizability: 428.8351406|0.9358042|237.0326985|1.2701306|5.5815305|101.0965743 unknown
InChI: InChI=1S/C17H19N3O/c1-19(2)11-5-7-13-14-8-6-12(20(3)4)10-16(14)17(18-21)15(13)9-11/h5-10,21H,1-4H3
charge 0 multiplicity 1
40 atoms
O  1.160829 3.267345 0.149504
N  -4.945742 0.082195 -0.010479
N  4.86125 -0.158142 0.012912
N  -0.143318 2.597579 0.11766
C  -0.802428 -0.946491 -0.029416
C  0.67139 -0.975333 -0.025551
C  -1.228927 0.417036 0.023527
C  1.163311 0.372275 0.030579
C  -0.01346 1.282126 0.063969
C  -2.58103 0.780758 0.030932
C  2.537446 0.661066 0.0447
C  -1.780925 -1.957725 -0.075078
C  1.596854 -2.033207 -0.066623
C  -3.581814 -0.246049 -0.016099
C  3.482864 -0.418453 0.001707
C  -3.151116 -1.613533 -0.068784
C  2.983683 -1.760479 -0.053359
C  -5.957049 -0.977025 -0.066467
C  -5.359943 1.488351 0.035448
C  5.817717 -1.266802 -0.048719
C  5.34607 1.224865 0.0807
H  -2.850502 1.838554 0.072123
H  2.861647 1.700168 0.086431
H  -1.495879 -3.015256 -0.116594
H  1.257902 -3.074596 -0.109234
H  -3.892272 -2.416682 -0.106151
H  3.682173 -2.6012 -0.085419
H  -5.88283 -1.667244 0.799703
H  -6.962007 -0.525859 -0.052012
H  -5.870814 -1.584945 -0.991426
H  -4.984851 2.059542 -0.839042
H  -4.995512 1.997229 0.951694
H  -6.460051 1.546934 0.030999
H  5.718536 -1.950619 0.820412
H  6.844109 -0.866605 -0.047539
H  5.690137 -1.871721 -0.970662
H  6.447771 1.22654 0.090651
H  5.011551 1.824962 -0.790673
H  4.996085 1.740435 0.998554
H  0.897647 4.222406 0.187722
