program: Gaussian 09
title: 000291286
version: EM64L-G09RevD.01
frameworkgroup: C1[X(C22H22N2O3)]
method: RPBEPBE
basis: SDD
operation: Freq
keyword: #p
keyword: freq=noraman
keyword: PBEPBE/SDD
title: #p freq=noraman PBEPBE/SDD
converged: YES YES NO NO
title: Mulliken charges:
elementType: O O O N N C C C C C C C C C C C C C C C C C C C C C C H H H H H H H H H H H H H H H H H H H H H H
charge: -0.278858 -0.269562 -0.241142 -0.230240 0.008275 -0.012972 0.063408 0.179356 0.185432 0.182190 0.126563 -0.471970 0.363259 0.188157 -0.473629 -0.351792 -0.860204 -0.850646 -0.254572 0.292991 -0.329088 -0.389113 -0.549791 -0.393004 0.305529 -0.537048 -0.755976 0.248584 0.260656 0.266940 0.260582 0.235890 0.243961 0.241328 0.243863 0.237670 0.241511 0.224935 0.252160 0.230932 0.242488 0.248892 0.237237 0.244934 0.216282 0.218080 0.244841 0.263062 0.249618
chargesum: 0.00000
title: Mulliken charges with hydrogens summed into heavy atoms:
elementType: O O O N N C C C C C C C C C C C C C C C C C C C C C C
charge: -0.278858 -0.269562 -0.241142 -0.230240 0.008275 -0.012972 0.063408 0.179356 0.185432 0.182190 0.126563 0.037270 0.363259 0.188157 -0.206689 -0.091209 -0.139025 -0.127602 0.222523 0.292991 -0.098156 -0.146625 -0.300899 -0.155767 0.305529 0.142247 0.001545
polarizability: 4.39245302e+02 -3.69584381e+01 2.83376786e+02 2.02411588e+01 2.73231576e+01 1.56534099e+02
1716.lowfreq: -6.5902 0.0006 0.0008 0.0011 3.3582 4.6182 16.2872 24.6990 35.9694
frequency: 15.8912 24.6953 35.9656 41.9441 50.7841 72.3349 78.9773 87.2677 105.2219 112.0330 120.9610 130.7855 131.7662 169.8077 177.2151 194.8577 223.6884 238.7258 254.9279 269.1238 275.2569 310.9729 325.0650 327.7563 356.2259 360.7406 371.9687 395.4380 408.0397 422.1759 431.5443 462.3331 472.1908 484.8074 495.0389 545.1778 560.3140 570.5620 589.3163 599.9950 608.8908 612.8964 622.0452 643.3844 676.9852 715.4863 724.8391 758.1802 764.5654 771.8010 798.0527 813.0675 814.7342 828.2251 867.1252 882.8754 884.0113 905.5489 918.7507 920.0303 951.6483 961.1642 988.6938 1003.1849 1011.2789 1015.6724 1022.2086 1034.8765 1038.5807 1045.3230 1061.1728 1069.4078 1088.4613 1097.8291 1112.5756 1134.5058 1140.8611 1168.7278 1171.5334 1189.8635 1203.8274 1227.4913 1233.1470 1245.7296 1268.2605 1299.0091 1305.5526 1328.9762 1349.2464 1349.8722 1364.7694 1371.9489 1382.8278 1398.6826 1399.9809 1404.4225 1407.7099 1415.3314 1430.8151 1437.0008 1453.7326 1455.2143 1458.7364 1463.6705 1465.6343 1466.2081 1470.4066 1474.4945 1474.9145 1479.1019 1482.4741 1497.5056 1508.7587 1568.9355 1583.8163 1592.4499 1605.2535 1635.4899 1665.7710 2952.1698 2974.8594 2980.1051 3003.9677 3007.4114 3010.3572 3037.0129 3051.3540 3059.6443 3079.5482 3085.3451 3094.3356 3116.7463 3121.5395 3123.5790 3134.5843 3137.2498 3143.8818 3153.1517 3167.0296 3173.3057 3199.1671
redmass: 6.8627 5.8597 3.4400 4.7777 3.8105 2.4898 1.4037 2.2407 2.1248 3.0061 3.7308 1.7529 3.0607 2.6899 2.8026 2.5148 2.1110 3.4361 1.5634 3.1537 5.5646 2.8568 3.9054 3.0702 4.9126 4.3679 2.9475 3.6358 4.9867 3.2812 2.8339 3.2033 4.8017 3.2994 5.5672 4.8575 3.0817 3.4197 3.3916 4.8046 5.3345 5.5198 3.7243 4.1100 6.4819 4.0669 5.5151 5.1292 3.8893 3.9409 1.5165 4.8195 3.4176 1.4423 3.3261 1.7706 2.7286 4.0014 1.5755 1.3360 2.6576 1.4184 1.8753 4.6558 2.8619 2.8076 3.0837 1.4932 1.5747 1.6504 2.0403 2.7287 2.4880 3.1535 1.2594 2.2519 1.7647 1.7418 1.8059 3.0303 2.2224 2.4531 1.4381 1.7477 1.4499 1.8420 3.7691 2.3364 3.2916 1.3331 1.4070 2.3801 1.2530 1.6231 1.5499 3.7759 1.9181 5.2344 1.7016 1.3924 1.0683 1.0479 1.6315 1.0900 1.5891 1.0662 2.0648 2.1875 1.1180 1.1379 1.4950 1.2834 1.0854 7.4881 6.7224 7.1988 7.8739 7.7025 9.2061 1.0334 1.0473 1.0417 1.0378 1.0582 1.0653 1.1036 1.0968 1.0911 1.0970 1.1060 1.0962 1.0944 1.0987 1.0919 1.0869 1.0895 1.1011 1.0871 1.0959 1.0954 1.0914
irintensity: 0.3121 0.7807 0.1882 0.1253 1.7360 6.3098 1.7931 0.0699 0.4511 3.3968 0.9489 0.8183 0.5615 4.9609 1.8657 1.9016 0.7566 2.8243 3.7047 6.1355 0.1772 3.3292 1.2832 1.7362 1.1814 0.9537 7.6343 3.8899 7.0573 0.0680 0.4776 15.8652 0.2879 6.1974 0.6620 8.2886 3.5498 2.0533 3.5151 10.3580 8.2598 5.2607 2.9888 1.1580 3.0302 19.3908 0.8660 10.9996 0.8235 18.2056 54.5153 16.5433 2.6540 42.0490 8.7327 8.7553 22.5728 29.9129 1.2362 4.8648 10.9949 0.0085 17.3398 41.5181 63.7358 99.8751 26.5466 4.7925 1.3494 13.3577 2.7479 2.0163 3.1941 2.4560 0.1355 3.4293 43.5766 75.1712 50.7348 298.5635 103.5834 16.3154 13.1853 37.0904 39.2290 41.2338 33.7678 76.5594 78.6709 3.0269 2.4671 20.6878 57.2431 0.1008 11.1262 33.2412 6.4564 9.2294 24.0723 24.9240 21.3453 13.1828 25.7323 21.6816 154.2106 15.3458 43.2272 101.4994 14.5579 13.1282 59.4298 68.5687 8.9118 15.7322 12.8997 54.4923 81.1777 18.6636 168.5932 95.1115 40.6086 16.9811 1.8280 14.5721 50.1602 52.7990 13.3896 16.2723 14.1528 26.6451 6.8255 11.6495 28.3645 15.5994 17.6229 23.3127 8.1927 8.4822 37.6458 7.9822 3.0230
temp: 298.150 k
press: 1.00000 atm
elementType: 8 8 8 7 7 6 6 6 6 6 6 6 6 6 6 6 6 6 6 6 6 6 6 6 6 6 6 1 1 1 1 1 1 1 1 1 1 1 1 1 1 1 1 1 1 1 1 1 1
symmnumber: 1
zpe: 1026243.2 jmol-1
zpe.correction: 0.390875 hartree
zpe.thermalcorrener: 0.416008 hartree
zpe.thermalcorrenthalpy: 0.416952 hartree
zpe.thermalcorrgfe: 0.334113 hartree
zpe.sumelectzpe: -1184.803695 hartree
zpe.sumelectthermal: -1184.778562 hartree
zpe.sumelectthermalent: -1184.777618 hartree
zpe.sumelectthermalfe: -1184.860458 hartree
dipole: -6.3953 -1.8943 -3.2247
dipole: 7.4086
quadrupole: -156.7589 -149.8338 -163.2030
quadrupole: -14.3664 -2.3439 12.3136
quadrupole: -0.1603 6.7648 -6.6044 -14.3664 -2.3439 12.3136
hfenergy: -1185.1945706 hartree
pointgroup: C01 [X(C22H22N2O3)]
dipole: 2.5302361 -0.7054983 1.2633065 debye
polarizability: 441.1853993|34.5010695|277.839328|11.2757795|-36.5367363|160.1314591 unknown
InChI: InChI=1S/C22H22N2O3/c1-13-19-12-23-8-7-17(19)14(2)22-21(13)18-11-16(26-4)5-6-20(18)24(22)9-10-27-15(3)25/h5-8,11-12H,9-10H2,1-4H3
charge 0 multiplicity 1
49 atoms
O  2.697416 -2.957142 0.317642
O  3.418352 3.716347 -0.438339
O  2.043769 -3.740203 -1.788254
N  0.478298 -0.87982 0.860058
N  -5.604128 1.096086 -0.542928
C  -0.826529 -0.454979 0.495063
C  -0.726933 0.910398 -0.012499
C  0.687226 1.289389 0.039244
C  1.395245 0.166491 0.581836
C  -2.054126 -1.144021 0.551214
C  -1.859044 1.626583 -0.436344
C  0.85932 -2.044021 1.66996
C  -3.226866 -0.391718 0.184378
C  -3.139976 0.980698 -0.304878
C  1.402813 2.46021 -0.293271
C  2.784801 0.202682 0.794796
C  -2.205694 -2.611204 0.9276
C  -1.700825 3.026578 -1.000349
C  1.355708 -3.264514 0.87486
C  2.800637 2.501315 -0.076979
C  -4.54859 -0.952022 0.283674
C  3.490522 1.383228 0.463228
C  -4.375569 1.639496 -0.642631
C  -5.668816 -0.206236 -0.075461
C  2.904185 -3.211252 -1.054617
C  4.861478 3.826401 -0.232502
C  4.27967 -2.738325 -1.463975
H  1.658984 -1.731589 2.367375
H  0.00391 -2.35285 2.293066
H  0.924794 3.349346 -0.705946
H  3.323535 -0.666712 1.180596
H  -2.513741 -2.751756 1.982888
H  -2.976228 -3.092056 0.300992
H  -1.281131 -3.181927 0.764256
H  -0.981583 3.026299 -1.840051
H  -2.641655 3.450668 -1.377938
H  -1.307238 3.721632 -0.234144
H  1.479956 -4.129863 1.551729
H  0.683375 -3.536207 0.042829
H  -4.694535 -1.967469 0.661098
H  4.571443 1.417435 0.627722
H  -4.361541 2.67195 -1.005986
H  -6.677129 -0.626824 0.003991
H  5.124006 4.840077 -0.569707
H  5.416176 3.080002 -0.835381
H  5.129077 3.709674 0.836547
H  5.045293 -3.122342 -0.76937
H  4.313153 -1.634501 -1.421781
H  4.495636 -3.071034 -2.489214
